cloudstack-dev mailing list archives

Site index · List index
Message view « Date » · « Thread »
Top « Date » · « Thread »
From jenk...@cloudstack.org
Subject Build failed in Jenkins: build-master-noredist #2177
Date Tue, 28 Jan 2014 11:43:21 GMT
See <http://jenkins.buildacloud.org/job/build-master-noredist/2177/changes>

Changes:

[likitha.shetty] CLOUDSTACK-5965. VM displayname is not returned by API.

------------------------------------------
[...truncated 5496 lines...]
[INFO] Starting audit...
Audit done.

[INFO] 
[INFO] --- maven-remote-resources-plugin:1.3:process (default) @ cloud-quickcloud ---
[INFO] 
[INFO] --- maven-resources-plugin:2.5:resources (default-resources) @ cloud-quickcloud ---
[debug] execute contextualize
[INFO] Using 'UTF-8' encoding to copy filtered resources.
[INFO] Copying 1 resource
[INFO] Copying 3 resources
[INFO] 
[INFO] --- maven-compiler-plugin:2.5.1:compile (default-compile) @ cloud-quickcloud ---
[INFO] No sources to compile
[INFO] 
[INFO] --- maven-resources-plugin:2.5:testResources (default-testResources) @ cloud-quickcloud
---
[debug] execute contextualize
[INFO] Using 'UTF-8' encoding to copy filtered resources.
[INFO] skip non existing resourceDirectory <http://jenkins.buildacloud.org/job/build-master-noredist/ws/quickcloud/src/test/resources>
[INFO] Copying 3 resources
[INFO] 
[INFO] --- maven-compiler-plugin:2.5.1:testCompile (default-testCompile) @ cloud-quickcloud
---
[INFO] No sources to compile
[INFO] 
[INFO] --- maven-surefire-plugin:2.12:test (default-test) @ cloud-quickcloud ---
[INFO] Surefire report directory: <http://jenkins.buildacloud.org/job/build-master-noredist/ws/quickcloud/target/surefire-reports>

-------------------------------------------------------
 T E S T S
-------------------------------------------------------

Results :

Tests run: 0, Failures: 0, Errors: 0, Skipped: 0

[INFO] 
[INFO] --- maven-jar-plugin:2.4:jar (default-jar) @ cloud-quickcloud ---
[INFO] Building jar: <http://jenkins.buildacloud.org/job/build-master-noredist/ws/quickcloud/target/cloud-quickcloud-4.4.0-SNAPSHOT.jar>
[INFO] 
[INFO] --- maven-site-plugin:3.3:attach-descriptor (attach-descriptor) @ cloud-quickcloud
---
[INFO] 
[INFO] --- maven-install-plugin:2.3.1:install (default-install) @ cloud-quickcloud ---
[INFO] Installing <http://jenkins.buildacloud.org/job/build-master-noredist/ws/quickcloud/target/cloud-quickcloud-4.4.0-SNAPSHOT.jar>
to /jenkins/.m2/repository/org/apache/cloudstack/cloud-quickcloud/4.4.0-SNAPSHOT/cloud-quickcloud-4.4.0-SNAPSHOT.jar
[INFO] Installing <http://jenkins.buildacloud.org/job/build-master-noredist/ws/quickcloud/pom.xml>
to /jenkins/.m2/repository/org/apache/cloudstack/cloud-quickcloud/4.4.0-SNAPSHOT/cloud-quickcloud-4.4.0-SNAPSHOT.pom
[INFO]                                                                         
[INFO] ------------------------------------------------------------------------
[INFO] Building Apache CloudStack AWS API Bridge 4.4.0-SNAPSHOT
[INFO] ------------------------------------------------------------------------
[WARNING] The POM for org.apache.rampart:rampart-policy:jar:1.5.1 is invalid, transitive dependencies
(if any) will not be available, enable debug logging for more details
[WARNING] The POM for org.apache.rampart:rampart-trust:jar:1.5.1 is invalid, transitive dependencies
(if any) will not be available, enable debug logging for more details
[WARNING] The POM for org.apache.axis2:axis2-kernel:jar:1.5.4 is invalid, transitive dependencies
(if any) will not be available, enable debug logging for more details
[WARNING] The POM for org.apache.axis2:mex:jar:impl:1.5.4 is invalid, transitive dependencies
(if any) will not be available, enable debug logging for more details
[WARNING] The POM for org.apache.axis2:axis2-mtompolicy:jar:1.5.4 is invalid, transitive dependencies
(if any) will not be available, enable debug logging for more details
[WARNING] The POM for org.apache.axis2:addressing:mar:1.5.4 is invalid, transitive dependencies
(if any) will not be available, enable debug logging for more details
[WARNING] The POM for org.apache.ws.commons.axiom:axiom-dom:jar:1.2.10 is invalid, transitive
dependencies (if any) will not be available, enable debug logging for more details
[WARNING] The POM for org.apache.ws.security:wss4j:jar:1.5.10 is invalid, transitive dependencies
(if any) will not be available, enable debug logging for more details
[WARNING] The POM for org.apache.santuario:xmlsec:jar:1.4.2 is invalid, transitive dependencies
(if any) will not be available, enable debug logging for more details
[WARNING] The POM for org.opensaml:opensaml:jar:2.2.3 is invalid, transitive dependencies
(if any) will not be available, enable debug logging for more details
[WARNING] The POM for org.slf4j:slf4j-jdk14:jar:1.5.2 is invalid, transitive dependencies
(if any) will not be available, enable debug logging for more details
[WARNING] The POM for commons-lang:commons-lang:jar:2.3 is invalid, transitive dependencies
(if any) will not be available, enable debug logging for more details
[WARNING] The POM for bouncycastle:bcprov-jdk14:jar:140 is invalid, transitive dependencies
(if any) will not be available, enable debug logging for more details
[INFO] 
[INFO] --- maven-clean-plugin:2.5:clean (default-clean) @ cloud-awsapi ---
[INFO] Deleting <http://jenkins.buildacloud.org/job/build-master-noredist/ws/awsapi/target>
(includes = [**/*], excludes = [])
[INFO] Deleting <http://jenkins.buildacloud.org/job/build-master-noredist/ws/awsapi>
(includes = [target, dist], excludes = [])
[INFO] 
[INFO] --- maven-remote-resources-plugin:1.3:process (default) @ cloud-awsapi ---
[WARNING] Invalid POM for org.apache.rampart:rampart-policy:jar:1.5.1, transitive dependencies
(if any) will not be available, enable debug logging for more details
[WARNING] Invalid POM for org.apache.rampart:rampart-trust:jar:1.5.1, transitive dependencies
(if any) will not be available, enable debug logging for more details
[WARNING] Invalid POM for org.apache.axis2:axis2-kernel:jar:1.5.4, transitive dependencies
(if any) will not be available, enable debug logging for more details
[WARNING] Invalid POM for org.apache.axis2:mex:jar:impl:1.5.4, transitive dependencies (if
any) will not be available, enable debug logging for more details
[WARNING] Invalid POM for org.apache.axis2:axis2-mtompolicy:jar:1.5.4, transitive dependencies
(if any) will not be available, enable debug logging for more details
[WARNING] Invalid POM for org.apache.axis2:addressing:mar:1.5.4, transitive dependencies (if
any) will not be available, enable debug logging for more details
[WARNING] Invalid POM for org.apache.ws.commons.axiom:axiom-dom:jar:1.2.10, transitive dependencies
(if any) will not be available, enable debug logging for more details
[WARNING] Invalid POM for org.apache.ws.security:wss4j:jar:1.5.10, transitive dependencies
(if any) will not be available, enable debug logging for more details
[WARNING] Invalid POM for org.apache.santuario:xmlsec:jar:1.4.2, transitive dependencies (if
any) will not be available, enable debug logging for more details
[WARNING] Invalid POM for org.opensaml:opensaml:jar:2.2.3, transitive dependencies (if any)
will not be available, enable debug logging for more details
[WARNING] Invalid POM for org.slf4j:slf4j-jdk14:jar:1.5.2, transitive dependencies (if any)
will not be available, enable debug logging for more details
[WARNING] Invalid POM for commons-lang:commons-lang:jar:2.3, transitive dependencies (if any)
will not be available, enable debug logging for more details
[WARNING] Invalid POM for org.apache.rampart:rampart-policy:jar:1.5.1, transitive dependencies
(if any) will not be available, enable debug logging for more details
[WARNING] Invalid POM for org.apache.rampart:rampart-trust:jar:1.5.1, transitive dependencies
(if any) will not be available, enable debug logging for more details
[WARNING] Invalid POM for org.apache.axis2:axis2-kernel:jar:1.5.4, transitive dependencies
(if any) will not be available, enable debug logging for more details
[WARNING] Invalid POM for org.apache.axis2:mex:jar:impl:1.5.4, transitive dependencies (if
any) will not be available, enable debug logging for more details
[WARNING] Invalid POM for org.apache.axis2:axis2-mtompolicy:jar:1.5.4, transitive dependencies
(if any) will not be available, enable debug logging for more details
[WARNING] Invalid POM for org.apache.axis2:addressing:mar:1.5.4, transitive dependencies (if
any) will not be available, enable debug logging for more details
[WARNING] Invalid POM for org.apache.ws.commons.axiom:axiom-dom:jar:1.2.10, transitive dependencies
(if any) will not be available, enable debug logging for more details
[WARNING] Invalid POM for org.apache.ws.security:wss4j:jar:1.5.10, transitive dependencies
(if any) will not be available, enable debug logging for more details
[WARNING] Invalid POM for org.apache.santuario:xmlsec:jar:1.4.2, transitive dependencies (if
any) will not be available, enable debug logging for more details
[WARNING] Invalid POM for org.opensaml:opensaml:jar:2.2.3, transitive dependencies (if any)
will not be available, enable debug logging for more details
[WARNING] Invalid POM for org.slf4j:slf4j-jdk14:jar:1.5.2, transitive dependencies (if any)
will not be available, enable debug logging for more details
[WARNING] Invalid POM for commons-lang:commons-lang:jar:2.3, transitive dependencies (if any)
will not be available, enable debug logging for more details
[WARNING] Invalid POM for bouncycastle:bcprov-jdk14:jar:140, transitive dependencies (if any)
will not be available, enable debug logging for more details
[WARNING] Invalid POM for org.apache.rampart:rampart-policy:jar:1.5.1, transitive dependencies
(if any) will not be available, enable debug logging for more details
[WARNING] Invalid POM for org.apache.rampart:rampart-trust:jar:1.5.1, transitive dependencies
(if any) will not be available, enable debug logging for more details
[WARNING] Invalid POM for org.apache.santuario:xmlsec:jar:1.4.2, transitive dependencies (if
any) will not be available, enable debug logging for more details
[WARNING] Invalid project model for artifact [addressing:org.apache.axis2:1.5.4]. It will
be ignored by the remote resources Mojo.
[WARNING] Invalid project model for artifact [bcprov-jdk14:bouncycastle:140]. It will be ignored
by the remote resources Mojo.
[WARNING] Invalid project model for artifact [commons-lang:commons-lang:2.3]. It will be ignored
by the remote resources Mojo.
[WARNING] Invalid project model for artifact [rampart-trust:org.apache.rampart:1.5.1]. It
will be ignored by the remote resources Mojo.
[WARNING] Invalid project model for artifact [rampart-policy:org.apache.rampart:1.5.1]. It
will be ignored by the remote resources Mojo.
[WARNING] Invalid project model for artifact [xmlsec:org.apache.santuario:1.4.2]. It will
be ignored by the remote resources Mojo.
[WARNING] Invalid project model for artifact [mex:org.apache.axis2:1.5.4]. It will be ignored
by the remote resources Mojo.
[WARNING] Invalid project model for artifact [axiom-dom:org.apache.ws.commons.axiom:1.2.10].
It will be ignored by the remote resources Mojo.
[WARNING] Invalid project model for artifact [axis2-mtompolicy:org.apache.axis2:1.5.4]. It
will be ignored by the remote resources Mojo.
[INFO] 
[INFO] --- maven-antrun-plugin:1.7:run (generate-resource) @ cloud-awsapi ---
[INFO] Executing tasks

main:
     [copy] Copying 3 files to <http://jenkins.buildacloud.org/job/build-master-noredist/ws/awsapi/target/generated-webapp/WEB-INF/classes>
[INFO] Executed tasks
[INFO] 
[INFO] --- maven-resources-plugin:2.5:resources (default-resources) @ cloud-awsapi ---
[debug] execute contextualize
[INFO] Using 'UTF-8' encoding to copy filtered resources.
[INFO] Copying 2 resources
[INFO] Copying 2 resources
[INFO] Copying 3 resources
[INFO] Copying 3 resources
[INFO] 
[INFO] --- maven-compiler-plugin:2.5.1:compile (default-compile) @ cloud-awsapi ---
[INFO] Compiling 1295 source files to <http://jenkins.buildacloud.org/job/build-master-noredist/ws/awsapi/target/classes>
[INFO] -------------------------------------------------------------
[ERROR] COMPILATION ERROR : 
[INFO] -------------------------------------------------------------
[ERROR] error: error reading /jenkins/.m2/repository/org/apache/axis2/mex/1.5.4/mex-1.5.4-impl.jar;
error in opening zip file
[ERROR] error: error reading /jenkins/.m2/repository/org/apache/axis2/axis2-mtompolicy/1.5.4/axis2-mtompolicy-1.5.4.jar;
error in opening zip file
[ERROR] error: error reading /jenkins/.m2/repository/org/apache/ws/commons/axiom/axiom-dom/1.2.10/axiom-dom-1.2.10.jar;
error in opening zip file
[ERROR] error: error reading /jenkins/.m2/repository/commons-lang/commons-lang/2.3/commons-lang-2.3.jar;
error in opening zip file
[INFO] 4 errors 
[INFO] -------------------------------------------------------------
[INFO] ------------------------------------------------------------------------
[INFO] Reactor Summary:
[INFO] 
[INFO] Apache CloudStack Developer Tools - Checkstyle Configuration  SUCCESS [2.276s]
[INFO] Apache CloudStack ................................. SUCCESS [3.261s]
[INFO] Apache CloudStack Maven Conventions Parent ........ SUCCESS [1.874s]
[INFO] Apache CloudStack Framework - Managed Context ..... SUCCESS [4.209s]
[INFO] Apache CloudStack Utils ........................... SUCCESS [17.313s]
[INFO] Apache CloudStack Framework ....................... SUCCESS [1.910s]
[INFO] Apache CloudStack Framework - Event Notification .. SUCCESS [10.842s]
[INFO] Apache CloudStack Framework - Configuration ....... SUCCESS [5.450s]
[INFO] Apache CloudStack API ............................. SUCCESS [22.274s]
[INFO] Apache CloudStack Framework - REST ................ SUCCESS [3.083s]
[INFO] Apache CloudStack Framework - IPC ................. SUCCESS [7.463s]
[INFO] Apache CloudStack Cloud Engine .................... SUCCESS [4.673s]
[INFO] Apache CloudStack Cloud Engine API ................ SUCCESS [6.067s]
[INFO] Apache CloudStack Framework - Security ............ SUCCESS [3.275s]
[INFO] Apache CloudStack Core ............................ SUCCESS [13.079s]
[INFO] Apache CloudStack Agents .......................... SUCCESS [8.808s]
[INFO] Apache CloudStack Framework - Clustering .......... SUCCESS [4.169s]
[INFO] Apache CloudStack Framework - Jobs ................ SUCCESS [5.876s]
[INFO] Apache CloudStack Cloud Engine Schema Component ... SUCCESS [17.353s]
[INFO] Apache CloudStack Framework - Event Notification .. SUCCESS [2.234s]
[INFO] Apache CloudStack Cloud Engine Internal Components API  SUCCESS [4.928s]
[INFO] Apache CloudStack Server .......................... SUCCESS [1:04.323s]
[INFO] Apache CloudStack Usage Server .................... SUCCESS [8.983s]
[INFO] Apache XenSource XAPI ............................. SUCCESS [9.731s]
[INFO] Apache CloudStack Cloud Engine Orchestration Component  SUCCESS [14.604s]
[INFO] Apache CloudStack Cloud Services .................. SUCCESS [1.583s]
[INFO] Apache CloudStack Secondary Storage Service ....... SUCCESS [8.748s]
[INFO] Apache CloudStack Engine Storage Component ........ SUCCESS [9.500s]
[INFO] Apache CloudStack Engine Storage Volume Component . SUCCESS [5.859s]
[INFO] Apache CloudStack Engine Storage Image Component .. SUCCESS [5.692s]
[INFO] Apache CloudStack Engine Storage Data Motion Component  SUCCESS [3.229s]
[INFO] Apache CloudStack Engine Storage Cache Component .. SUCCESS [2.927s]
[INFO] Apache CloudStack Engine Storage Snapshot Component  SUCCESS [11.286s]
[INFO] Apache CloudStack Cloud Engine API ................ SUCCESS [2.464s]
[INFO] Apache CloudStack Cloud Engine Service ............ SUCCESS [4.718s]
[INFO] Apache CloudStack Plugin POM ...................... SUCCESS [3.523s]
[INFO] Apache CloudStack Plugin - API Rate Limit ......... SUCCESS [8.647s]
[INFO] Apache CloudStack Plugin - API Discovery .......... SUCCESS [5.841s]
[INFO] Apache CloudStack Plugin - ACL Static Role Based .. SUCCESS [2.695s]
[INFO] Apache CloudStack Plugin - Host Anti-Affinity Processor  SUCCESS [2.751s]
[INFO] Apache CloudStack Plugin - Explicit Dedication Processor  SUCCESS [3.072s]
[INFO] Apache CloudStack Plugin - User Concentrated Pod Deployment Planner  SUCCESS [2.978s]
[INFO] Apache CloudStack Plugin - User Dispersing Deployment Planner  SUCCESS [2.813s]
[INFO] Apache CloudStack Plugin - Implicit Dedication Planner  SUCCESS [10.038s]
[INFO] Apache CloudStack Plugin - Skip Heurestics Planner  SUCCESS [2.774s]
[INFO] Apache CloudStack Plugin - Host Allocator Random .. SUCCESS [3.011s]
[INFO] Apache CloudStack Plugin - Dedicated Resources .... SUCCESS [8.981s]
[INFO] Apache CloudStack Plugin - Hypervisor OracleVM .... SUCCESS [4.745s]
[INFO] Apache CloudStack Plugin - Open vSwitch ........... SUCCESS [3.996s]
[INFO] Apache CloudStack Plugin - Hypervisor Xen ......... SUCCESS [14.263s]
[INFO] Apache CloudStack Plugin - Hypervisor KVM ......... SUCCESS [12.735s]
[INFO] Apache CloudStack Plugin - RabbitMQ Event Bus ..... SUCCESS [3.354s]
[INFO] Apache CloudStack Plugin - In Memory Event Bus .... SUCCESS [3.018s]
[INFO] Apache CloudStack Plugin - Hypervisor Baremetal ... SUCCESS [6.133s]
[INFO] Apache CloudStack Plugin - Hypervisor UCS ......... SUCCESS [3.533s]
[INFO] Apache CloudStack Plugin - Hypervisor Hyper-V ..... SUCCESS [10.459s]
[INFO] Apache CloudStack Plugin - Network Elastic Load Balancer  SUCCESS [4.612s]
[INFO] Apache CloudStack Plugin - Network Internal Load Balancer  SUCCESS [16.022s]
[INFO] Apache CloudStack Framework - Spring Life Cycle ... SUCCESS [5.366s]
[INFO] Apache CloudStack Plugin - Network Juniper Contrail  SUCCESS [25.853s]
[INFO] Apache CloudStack Plugin - Palo Alto .............. SUCCESS [21.327s]
[INFO] Apache CloudStack Plugin - Network Nicira NVP ..... SUCCESS [27.121s]
[INFO] Apache CloudStack Plugin - BigSwitch Virtual Network Segment  SUCCESS [17.044s]
[INFO] Apache CloudStack Plugin - Midokura Midonet ....... SUCCESS [19.788s]
[INFO] Apache CloudStack Plugin - Stratosphere SSP ....... SUCCESS [16.404s]
[INFO] Apache CloudStack Plugin - Network Opendaylight ... SUCCESS [17.885s]
[INFO] Apache CloudStack Plugin - Storage Allocator Random  SUCCESS [8.887s]
[INFO] Apache CloudStack Plugin - User Authenticator LDAP  SUCCESS [11.774s]
[INFO] Apache CloudStack Plugin - User Authenticator MD5 . SUCCESS [7.886s]
[INFO] Apache CloudStack Plugin - User Authenticator Plain Text  SUCCESS [8.080s]
[INFO] Apache CloudStack Plugin - User Authenticator SHA256 Salted  SUCCESS [15.265s]
[INFO] Apache CloudStack Plugin - Dns Notifier Example ... SUCCESS [7.973s]
[INFO] Apache CloudStack Plugin - Storage Image S3 ....... SUCCESS [8.249s]
[INFO] Apache CloudStack Plugin - Storage Image Swift provider  SUCCESS [5.588s]
[INFO] Apache CloudStack Plugin - Storage Image default provider  SUCCESS [5.260s]
[INFO] Apache CloudStack Plugin - Storage Image sample provider  SUCCESS [3.925s]
[INFO] Apache CloudStack Plugin - Storage Volume Nexenta Provider  SUCCESS [11.839s]
[INFO] Apache CloudStack Plugin - Storage Volume SolidFire Provider  SUCCESS [15.744s]
[INFO] Apache CloudStack Plugin - Storage Volume default provider  SUCCESS [8.668s]
[INFO] Apache CloudStack Plugin - Storage Volume sample provider  SUCCESS [6.258s]
[INFO] Apache CloudStack Plugin - SNMP Alerts ............ SUCCESS [14.601s]
[INFO] Apache CloudStack Plugin - Syslog Alerts .......... SUCCESS [14.012s]
[INFO] Apache CloudStack Plugin - Network VXLAN .......... SUCCESS [15.535s]
[INFO] Apache CloudStack Framework - Spring Module ....... SUCCESS [18.286s]
[INFO] Apache CloudStack Console Proxy - RDP Client ...... SUCCESS [22.018s]
[INFO] Apache CloudStack Console Proxy ................... SUCCESS [0.986s]
[INFO] Apache CloudStack Console Proxy - Server .......... SUCCESS [10.612s]
[INFO] Apache CloudStack System VM ....................... SUCCESS [25.280s]
[INFO] Apache CloudStack Client UI ....................... SUCCESS [34.673s]
[INFO] Apache CloudStack Framework - QuickCloud .......... SUCCESS [0.802s]
[INFO] Apache CloudStack AWS API Bridge .................. FAILURE [12.613s]
[INFO] ------------------------------------------------------------------------
[INFO] BUILD FAILURE
[INFO] ------------------------------------------------------------------------
[INFO] Total time: 14:53.792s
[INFO] Finished at: Tue Jan 28 12:41:57 CET 2014
[INFO] Final Memory: 86M/209M
[INFO] ------------------------------------------------------------------------
[ERROR] Failed to execute goal org.apache.maven.plugins:maven-compiler-plugin:2.5.1:compile
(default-compile) on project cloud-awsapi: Compilation failure: Compilation failure:
[ERROR] error: error reading /jenkins/.m2/repository/org/apache/axis2/mex/1.5.4/mex-1.5.4-impl.jar;
error in opening zip file
[ERROR] error: error reading /jenkins/.m2/repository/org/apache/axis2/axis2-mtompolicy/1.5.4/axis2-mtompolicy-1.5.4.jar;
error in opening zip file
[ERROR] error: error reading /jenkins/.m2/repository/org/apache/ws/commons/axiom/axiom-dom/1.2.10/axiom-dom-1.2.10.jar;
error in opening zip file
[ERROR] error: error reading /jenkins/.m2/repository/commons-lang/commons-lang/2.3/commons-lang-2.3.jar;
error in opening zip file
[ERROR] -> [Help 1]
[ERROR] 
[ERROR] To see the full stack trace of the errors, re-run Maven with the -e switch.
[ERROR] Re-run Maven using the -X switch to enable full debug logging.
[ERROR] 
[ERROR] For more information about the errors and possible solutions, please read the following
articles:
[ERROR] [Help 1] http://cwiki.apache.org/confluence/display/MAVEN/MojoFailureException
[ERROR] 
[ERROR] After correcting the problems, you can resume the build with the command
[ERROR]   mvn <goals> -rf :cloud-awsapi
Build step 'Invoke top-level Maven targets' marked build as failure
Archiving artifacts

Mime
View raw message