cloudstack-dev mailing list archives

Site index · List index
Message view « Date » · « Thread »
Top « Date » · « Thread »
From jenk...@cloudstack.org
Subject Build failed in Jenkins: cloudstack-4.3-forward-maven-build #32
Date Wed, 29 Jan 2014 16:48:57 GMT
See <http://jenkins.buildacloud.org/job/cloudstack-4.3-forward-maven-build/32/changes>

Changes:

[Daan Hoogland] CLOUDSTACK-5979 vlan parsing fixed

------------------------------------------
[...truncated 3436 lines...]
[INFO] ------------------------------------------------------------------------
[INFO] Building Apache CloudStack Plugin - Palo Alto 4.3.0
[INFO] ------------------------------------------------------------------------
[INFO] 
[INFO] --- maven-clean-plugin:2.5:clean (default-clean) @ cloud-plugin-network-palo-alto ---
[INFO] Deleting <http://jenkins.buildacloud.org/job/cloudstack-4.3-forward-maven-build/ws/plugins/network-elements/palo-alto/target>
(includes = [**/*], excludes = [])
[INFO] Deleting <http://jenkins.buildacloud.org/job/cloudstack-4.3-forward-maven-build/ws/plugins/network-elements/palo-alto>
(includes = [target, dist], excludes = [])
[INFO] 
[INFO] --- maven-remote-resources-plugin:1.3:process (default) @ cloud-plugin-network-palo-alto
---
[INFO] 
[INFO] --- maven-resources-plugin:2.5:resources (default-resources) @ cloud-plugin-network-palo-alto
---
[debug] execute contextualize
[INFO] Using 'UTF-8' encoding to copy filtered resources.
[INFO] Copying 2 resources
[INFO] Copying 3 resources
[INFO] 
[INFO] --- maven-compiler-plugin:2.5.1:compile (default-compile) @ cloud-plugin-network-palo-alto
---
[INFO] Compiling 10 source files to <http://jenkins.buildacloud.org/job/cloudstack-4.3-forward-maven-build/ws/plugins/network-elements/palo-alto/target/classes>
[INFO] 
[INFO] >>> findbugs-maven-plugin:2.5.3:check (cloudstack-findbugs) @ cloud-plugin-network-palo-alto
>>>
[INFO] 
[INFO] --- findbugs-maven-plugin:2.5.3:findbugs (findbugs) @ cloud-plugin-network-palo-alto
---
[INFO] Fork Value is true
[INFO] Done FindBugs Analysis....
[INFO] 
[INFO] <<< findbugs-maven-plugin:2.5.3:check (cloudstack-findbugs) @ cloud-plugin-network-palo-alto
<<<
[INFO] 
[INFO] --- findbugs-maven-plugin:2.5.3:check (cloudstack-findbugs) @ cloud-plugin-network-palo-alto
---
[INFO] BugInstance size is 0
[INFO] Error size is 0
[INFO] No errors/warnings found
[INFO] 
[INFO] --- maven-resources-plugin:2.5:testResources (default-testResources) @ cloud-plugin-network-palo-alto
---
[debug] execute contextualize
[INFO] Using 'UTF-8' encoding to copy filtered resources.
[INFO] skip non existing resourceDirectory <http://jenkins.buildacloud.org/job/cloudstack-4.3-forward-maven-build/ws/plugins/network-elements/palo-alto/test/resources>
[INFO] Copying 3 resources
[INFO] 
[INFO] --- maven-compiler-plugin:2.5.1:testCompile (default-testCompile) @ cloud-plugin-network-palo-alto
---
[INFO] Compiling 2 source files to <http://jenkins.buildacloud.org/job/cloudstack-4.3-forward-maven-build/ws/plugins/network-elements/palo-alto/target/test-classes>
[INFO] 
[INFO] --- maven-surefire-plugin:2.12:test (default-test) @ cloud-plugin-network-palo-alto
---
[INFO] Surefire report directory: <http://jenkins.buildacloud.org/job/cloudstack-4.3-forward-maven-build/ws/plugins/network-elements/palo-alto/target/surefire-reports>

-------------------------------------------------------
 T E S T S
-------------------------------------------------------
Running com.cloud.network.resource.PaloAltoResourceTest
log4j:WARN No appenders could be found for logger (com.cloud.network.resource.PaloAltoResource).
log4j:WARN Please initialize the log4j system properly.
log4j:WARN See http://logging.apache.org/log4j/1.2/faq.html#noconfig for more info.
Tests run: 16, Failures: 0, Errors: 0, Skipped: 0, Time elapsed: 1.564 sec

Results :

Tests run: 16, Failures: 0, Errors: 0, Skipped: 0

[INFO]                                                                         
[INFO] ------------------------------------------------------------------------
[INFO] Building Apache CloudStack Checkstyle Configuration 4.3.0
[INFO] ------------------------------------------------------------------------
[INFO] 
[INFO] --- maven-clean-plugin:2.5:clean (default-clean) @ checkstyle ---
[INFO] Deleting <http://jenkins.buildacloud.org/job/cloudstack-4.3-forward-maven-build/ws/parents/checkstyle/target>
(includes = [**/*], excludes = [])
[INFO] Deleting <http://jenkins.buildacloud.org/job/cloudstack-4.3-forward-maven-build/ws/parents/checkstyle>
(includes = [target, dist], excludes = [])
[INFO] 
[INFO] --- maven-remote-resources-plugin:1.3:process (default) @ checkstyle ---
[INFO] 
[INFO] --- maven-resources-plugin:2.5:resources (default-resources) @ checkstyle ---
[debug] execute contextualize
[INFO] Using 'UTF-8' encoding to copy filtered resources.
[INFO] Copying 1 resource
[INFO] Copying 3 resources
[INFO] 
[INFO] --- maven-compiler-plugin:2.5.1:compile (default-compile) @ checkstyle ---
[INFO] No sources to compile
[INFO] 
[INFO] >>> findbugs-maven-plugin:2.5.3:check (cloudstack-findbugs) @ checkstyle >>>
[INFO] 
[INFO] --- findbugs-maven-plugin:2.5.3:findbugs (findbugs) @ checkstyle ---
[INFO] 
[INFO] <<< findbugs-maven-plugin:2.5.3:check (cloudstack-findbugs) @ checkstyle <<<
[INFO] 
[INFO] --- findbugs-maven-plugin:2.5.3:check (cloudstack-findbugs) @ checkstyle ---
[INFO] 
[INFO] --- maven-resources-plugin:2.5:testResources (default-testResources) @ checkstyle ---
[debug] execute contextualize
[INFO] Using 'UTF-8' encoding to copy filtered resources.
[INFO] skip non existing resourceDirectory <http://jenkins.buildacloud.org/job/cloudstack-4.3-forward-maven-build/ws/parents/checkstyle/src/test/resources>
[INFO] Copying 3 resources
[INFO] 
[INFO] --- maven-compiler-plugin:2.5.1:testCompile (default-testCompile) @ checkstyle ---
[INFO] No sources to compile
[INFO] 
[INFO] --- maven-surefire-plugin:2.12:test (default-test) @ checkstyle ---
[INFO] Surefire report directory: <http://jenkins.buildacloud.org/job/cloudstack-4.3-forward-maven-build/ws/parents/checkstyle/target/surefire-reports>

-------------------------------------------------------
 T E S T S
-------------------------------------------------------

Results :

Tests run: 0, Failures: 0, Errors: 0, Skipped: 0

[INFO]                                                                         
[INFO] ------------------------------------------------------------------------
[INFO] Building Apache CloudStack Plugin - Network Nicira NVP 4.3.0
[INFO] ------------------------------------------------------------------------
[INFO] 
[INFO] --- maven-clean-plugin:2.5:clean (default-clean) @ cloud-plugin-network-nvp ---
[INFO] Deleting <http://jenkins.buildacloud.org/job/cloudstack-4.3-forward-maven-build/ws/plugins/network-elements/nicira-nvp/target>
(includes = [**/*], excludes = [])
[INFO] Deleting <http://jenkins.buildacloud.org/job/cloudstack-4.3-forward-maven-build/ws/plugins/network-elements/nicira-nvp>
(includes = [target, dist], excludes = [])
[INFO] 
[INFO] --- maven-checkstyle-plugin:2.10:check (default) @ cloud-plugin-network-nvp ---
[INFO] Starting audit...
Audit done.

[INFO] 
[INFO] --- maven-remote-resources-plugin:1.3:process (default) @ cloud-plugin-network-nvp
---
[INFO] 
[INFO] --- maven-resources-plugin:2.5:resources (default-resources) @ cloud-plugin-network-nvp
---
[debug] execute contextualize
[INFO] Using 'UTF-8' encoding to copy filtered resources.
[INFO] Copying 2 resources
[INFO] Copying 3 resources
[INFO] 
[INFO] --- maven-compiler-plugin:2.5.1:compile (default-compile) @ cloud-plugin-network-nvp
---
[INFO] Compiling 62 source files to <http://jenkins.buildacloud.org/job/cloudstack-4.3-forward-maven-build/ws/plugins/network-elements/nicira-nvp/target/classes>
[INFO] -------------------------------------------------------------
[ERROR] COMPILATION ERROR : 
[INFO] -------------------------------------------------------------
[ERROR] <http://jenkins.buildacloud.org/job/cloudstack-4.3-forward-maven-build/ws/plugins/network-elements/nicira-nvp/src/com/cloud/network/element/NiciraNvpElement.java>:[267,21]
cannot find symbol
symbol  : class URISyntaxException
location: class com.cloud.network.element.NiciraNvpElement
[INFO] 1 error
[INFO] -------------------------------------------------------------
[INFO] ------------------------------------------------------------------------
[INFO] Reactor Summary:
[INFO] 
[INFO] Apache CloudStack ................................. SUCCESS [2.161s]
[INFO] Apache CloudStack Maven Conventions Parent ........ SUCCESS [0.059s]
[INFO] Apache CloudStack Framework - Managed Context ..... SUCCESS [9.720s]
[INFO] Apache CloudStack Utils ........................... SUCCESS [26.311s]
[INFO] Apache CloudStack Framework ....................... SUCCESS [0.047s]
[INFO] Apache CloudStack Framework - Event Notification .. SUCCESS [20.435s]
[INFO] Apache CloudStack Framework - Configuration ....... SUCCESS [14.511s]
[INFO] Apache CloudStack API ............................. SUCCESS [36.073s]
[INFO] Apache CloudStack Framework - REST ................ SUCCESS [8.288s]
[INFO] Apache CloudStack Framework - IPC ................. SUCCESS [14.313s]
[INFO] Apache CloudStack Cloud Engine .................... SUCCESS [0.062s]
[INFO] Apache CloudStack Cloud Engine API ................ SUCCESS [12.188s]
[INFO] Apache CloudStack Core ............................ SUCCESS [25.650s]
[INFO] Apache CloudStack Agents .......................... SUCCESS [15.985s]
[INFO] Apache CloudStack Framework - Clustering .......... SUCCESS [14.202s]
[INFO] Apache CloudStack Framework - Jobs ................ SUCCESS [15.269s]
[INFO] Apache CloudStack Cloud Engine Schema Component ... SUCCESS [42.687s]
[INFO] Apache CloudStack Framework - Event Notification .. SUCCESS [7.194s]
[INFO] Apache CloudStack Cloud Engine Internal Components API  SUCCESS [11.364s]
[INFO] Apache CloudStack Server .......................... SUCCESS [1:41.158s]
[INFO] Apache CloudStack Usage Server .................... SUCCESS [19.075s]
[INFO] Apache XenSource XAPI ............................. SUCCESS [28.576s]
[INFO] Apache CloudStack Cloud Engine Orchestration Component  SUCCESS [32.322s]
[INFO] Apache CloudStack Cloud Services .................. SUCCESS [0.046s]
[INFO] Apache CloudStack Secondary Storage Service ....... SUCCESS [18.475s]
[INFO] Apache CloudStack Engine Storage Component ........ SUCCESS [20.013s]
[INFO] Apache CloudStack Engine Storage Volume Component . SUCCESS [15.545s]
[INFO] Apache CloudStack Engine Storage Image Component .. SUCCESS [13.708s]
[INFO] Apache CloudStack Engine Storage Data Motion Component  SUCCESS [10.737s]
[INFO] Apache CloudStack Engine Storage Cache Component .. SUCCESS [10.020s]
[INFO] Apache CloudStack Engine Storage Snapshot Component  SUCCESS [17.353s]
[INFO] Apache CloudStack Cloud Engine API ................ SUCCESS [7.363s]
[INFO] Apache CloudStack Cloud Engine Service ............ SUCCESS [0.901s]
[INFO] Apache CloudStack Plugin POM ...................... SUCCESS [0.421s]
[INFO] Apache CloudStack Plugin - API Rate Limit ......... SUCCESS [13.740s]
[INFO] Apache CloudStack Plugin - API Discovery .......... SUCCESS [12.212s]
[INFO] Apache CloudStack Plugin - ACL Static Role Based .. SUCCESS [8.445s]
[INFO] Apache CloudStack Plugin - Host Anti-Affinity Processor  SUCCESS [9.748s]
[INFO] Apache CloudStack Plugin - Explicit Dedication Processor  SUCCESS [9.952s]
[INFO] Apache CloudStack Plugin - User Concentrated Pod Deployment Planner  SUCCESS [9.091s]
[INFO] Apache CloudStack Plugin - User Dispersing Deployment Planner  SUCCESS [9.685s]
[INFO] Apache CloudStack Plugin - Implicit Dedication Planner  SUCCESS [13.980s]
[INFO] Apache CloudStack Plugin - Skip Heurestics Planner  SUCCESS [8.939s]
[INFO] Apache CloudStack Plugin - Host Allocator Random .. SUCCESS [9.035s]
[INFO] Apache CloudStack Plugin - Dedicated Resources .... SUCCESS [15.846s]
[INFO] Apache CloudStack Plugin - Hypervisor OracleVM .... SUCCESS [14.374s]
[INFO] Apache CloudStack Plugin - Open vSwitch ........... SUCCESS [14.267s]
[INFO] Apache CloudStack Plugin - Hypervisor Xen ......... SUCCESS [34.190s]
[INFO] Apache CloudStack Plugin - Hypervisor KVM ......... SUCCESS [27.940s]
[INFO] Apache CloudStack Plugin - RabbitMQ Event Bus ..... SUCCESS [9.605s]
[INFO] Apache CloudStack Plugin - Hypervisor Baremetal ... SUCCESS [18.327s]
[INFO] Apache CloudStack Plugin - Hypervisor UCS ......... SUCCESS [14.222s]
[INFO] Apache CloudStack Plugin - Hypervisor Hyper-V ..... SUCCESS [16.951s]
[INFO] Apache CloudStack Plugin - Network Elastic Load Balancer  SUCCESS [14.116s]
[INFO] Apache CloudStack Plugin - Network Internal Load Balancer  SUCCESS [19.266s]
[INFO] Apache CloudStack Plugin - Network Juniper Contrail  SUCCESS [21.120s]
[INFO] Apache CloudStack Plugin - Palo Alto .............. SUCCESS [18.636s]
[INFO] Apache CloudStack Checkstyle Configuration ........ SUCCESS [0.318s]
[INFO] Apache CloudStack Plugin - Network Nicira NVP ..... FAILURE [3.839s]
[INFO] Apache CloudStack Plugin - BigSwitch Virtual Network Segment  SKIPPED
[INFO] Apache CloudStack Plugin - Midokura Midonet ....... SKIPPED
[INFO] Apache Cloudstack Plugin - Stratosphere SSP ....... SKIPPED
[INFO] Apache CloudStack Plugin - Storage Allocator Random  SKIPPED
[INFO] Apache CloudStack Plugin - User Authenticator LDAP  SKIPPED
[INFO] Apache CloudStack Plugin - User Authenticator MD5 . SKIPPED
[INFO] Apache CloudStack Plugin - User Authenticator Plain Text  SKIPPED
[INFO] Apache CloudStack Plugin - User Authenticator SHA256 Salted  SKIPPED
[INFO] Apache CloudStack Plugin - Dns Notifier Example ... SKIPPED
[INFO] Apache CloudStack Plugin - Storage Image S3 ....... SKIPPED
[INFO] Apache CloudStack Plugin - Storage Image Swift provider  SKIPPED
[INFO] Apache CloudStack Plugin - Storage Image default provider  SKIPPED
[INFO] Apache CloudStack Plugin - Storage Image sample provider  SKIPPED
[INFO] Apache CloudStack Plugin - Storage Volume SolidFire Provider  SKIPPED
[INFO] Apache CloudStack Plugin - Storage Volume default provider  SKIPPED
[INFO] Apache CloudStack Plugin - Storage Volume sample provider  SKIPPED
[INFO] Apache CloudStack Plugin - SNMP Alerts ............ SKIPPED
[INFO] Apache CloudStack Plugin - Syslog Alerts .......... SKIPPED
[INFO] Apache CloudStack Plugin - Network VXLAN .......... SKIPPED
[INFO] Apache CloudStack Framework - Spring Life Cycle ... SKIPPED
[INFO] cloud-framework-spring-module ..................... SKIPPED
[INFO] Apache CloudStack Test ............................ SKIPPED
[INFO] Apache CloudStack Client UI ....................... SKIPPED
[INFO] Apache CloudStack Console Proxy - RDP Client ...... SKIPPED
[INFO] Apache CloudStack Console Proxy ................... SKIPPED
[INFO] Apache CloudStack Console Proxy - Server .......... SKIPPED
[INFO] Apache CloudStack Framework - QuickCloud .......... SKIPPED
[INFO] ------------------------------------------------------------------------
[INFO] BUILD FAILURE
[INFO] ------------------------------------------------------------------------
[INFO] Total time: 15:21.581s
[INFO] Finished at: Wed Jan 29 17:48:55 CET 2014
[INFO] Final Memory: 58M/145M
[INFO] ------------------------------------------------------------------------
[ERROR] Failed to execute goal org.apache.maven.plugins:maven-compiler-plugin:2.5.1:compile
(default-compile) on project cloud-plugin-network-nvp: Compilation failure
[ERROR] <http://jenkins.buildacloud.org/job/cloudstack-4.3-forward-maven-build/ws/plugins/network-elements/nicira-nvp/src/com/cloud/network/element/NiciraNvpElement.java>:[267,21]
cannot find symbol
[ERROR] symbol  : class URISyntaxException
[ERROR] location: class com.cloud.network.element.NiciraNvpElement
[ERROR] -> [Help 1]
[ERROR] 
[ERROR] To see the full stack trace of the errors, re-run Maven with the -e switch.
[ERROR] Re-run Maven using the -X switch to enable full debug logging.
[ERROR] 
[ERROR] For more information about the errors and possible solutions, please read the following
articles:
[ERROR] [Help 1] http://cwiki.apache.org/confluence/display/MAVEN/MojoFailureException
[ERROR] 
[ERROR] After correcting the problems, you can resume the build with the command
[ERROR]   mvn <goals> -rf :cloud-plugin-network-nvp
Build step 'Invoke top-level Maven targets' marked build as failure
[FINDBUGS] Skipping publisher since build result is FAILURE

Mime
View raw message