cloudstack-dev mailing list archives

Site index · List index
Message view « Date » · « Thread »
Top « Date » · « Thread »
From jenk...@cloudstack.org
Subject Build failed in Jenkins: build-master-noredist #2170
Date Mon, 27 Jan 2014 19:21:54 GMT
See <http://jenkins.buildacloud.org/job/build-master-noredist/2170/changes>

Changes:

[marcus] CLOUDSTACK-5956 remove persist flag during live migration

------------------------------------------
[...truncated 5502 lines...]
[INFO] --- maven-remote-resources-plugin:1.3:process (default) @ cloud-quickcloud ---
[INFO] 
[INFO] --- maven-resources-plugin:2.5:resources (default-resources) @ cloud-quickcloud ---
[debug] execute contextualize
[INFO] Using 'UTF-8' encoding to copy filtered resources.
[INFO] Copying 1 resource
[INFO] Copying 3 resources
[INFO] 
[INFO] --- maven-compiler-plugin:2.5.1:compile (default-compile) @ cloud-quickcloud ---
[INFO] No sources to compile
[INFO] 
[INFO] --- maven-resources-plugin:2.5:testResources (default-testResources) @ cloud-quickcloud
---
[debug] execute contextualize
[INFO] Using 'UTF-8' encoding to copy filtered resources.
[INFO] skip non existing resourceDirectory <http://jenkins.buildacloud.org/job/build-master-noredist/ws/quickcloud/src/test/resources>
[INFO] Copying 3 resources
[INFO] 
[INFO] --- maven-compiler-plugin:2.5.1:testCompile (default-testCompile) @ cloud-quickcloud
---
[INFO] No sources to compile
[INFO] 
[INFO] --- maven-surefire-plugin:2.12:test (default-test) @ cloud-quickcloud ---
[INFO] Surefire report directory: <http://jenkins.buildacloud.org/job/build-master-noredist/ws/quickcloud/target/surefire-reports>

-------------------------------------------------------
 T E S T S
-------------------------------------------------------

Results :

Tests run: 0, Failures: 0, Errors: 0, Skipped: 0

[INFO] 
[INFO] --- maven-jar-plugin:2.4:jar (default-jar) @ cloud-quickcloud ---
[INFO] Building jar: <http://jenkins.buildacloud.org/job/build-master-noredist/ws/quickcloud/target/cloud-quickcloud-4.4.0-SNAPSHOT.jar>
[INFO] 
[INFO] --- maven-site-plugin:3.3:attach-descriptor (attach-descriptor) @ cloud-quickcloud
---
[INFO] 
[INFO] --- maven-install-plugin:2.3.1:install (default-install) @ cloud-quickcloud ---
[INFO] Installing <http://jenkins.buildacloud.org/job/build-master-noredist/ws/quickcloud/target/cloud-quickcloud-4.4.0-SNAPSHOT.jar>
to /jenkins/.m2/repository/org/apache/cloudstack/cloud-quickcloud/4.4.0-SNAPSHOT/cloud-quickcloud-4.4.0-SNAPSHOT.jar
[INFO] Installing <http://jenkins.buildacloud.org/job/build-master-noredist/ws/quickcloud/pom.xml>
to /jenkins/.m2/repository/org/apache/cloudstack/cloud-quickcloud/4.4.0-SNAPSHOT/cloud-quickcloud-4.4.0-SNAPSHOT.pom
[INFO]                                                                         
[INFO] ------------------------------------------------------------------------
[INFO] Building Apache CloudStack AWS API Bridge 4.4.0-SNAPSHOT
[INFO] ------------------------------------------------------------------------
[WARNING] The POM for org.apache.rampart:rampart-policy:jar:1.5.1 is invalid, transitive dependencies
(if any) will not be available, enable debug logging for more details
[WARNING] The POM for org.apache.rampart:rampart-trust:jar:1.5.1 is invalid, transitive dependencies
(if any) will not be available, enable debug logging for more details
[WARNING] The POM for org.apache.axis2:axis2-kernel:jar:1.5.4 is invalid, transitive dependencies
(if any) will not be available, enable debug logging for more details
[WARNING] The POM for org.apache.axis2:mex:jar:impl:1.5.4 is invalid, transitive dependencies
(if any) will not be available, enable debug logging for more details
[WARNING] The POM for org.apache.axis2:axis2-mtompolicy:jar:1.5.4 is invalid, transitive dependencies
(if any) will not be available, enable debug logging for more details
[WARNING] The POM for org.apache.axis2:addressing:mar:1.5.4 is invalid, transitive dependencies
(if any) will not be available, enable debug logging for more details
[WARNING] The POM for org.apache.ws.commons.axiom:axiom-dom:jar:1.2.10 is invalid, transitive
dependencies (if any) will not be available, enable debug logging for more details
[WARNING] The POM for org.apache.ws.security:wss4j:jar:1.5.10 is invalid, transitive dependencies
(if any) will not be available, enable debug logging for more details
[WARNING] The POM for org.apache.santuario:xmlsec:jar:1.4.2 is invalid, transitive dependencies
(if any) will not be available, enable debug logging for more details
[WARNING] The POM for org.opensaml:opensaml1:jar:1.1 is invalid, transitive dependencies (if
any) will not be available, enable debug logging for more details
[WARNING] The POM for org.slf4j:slf4j-jdk14:jar:1.5.2 is invalid, transitive dependencies
(if any) will not be available, enable debug logging for more details
[WARNING] The POM for commons-lang:commons-lang:jar:2.3 is invalid, transitive dependencies
(if any) will not be available, enable debug logging for more details
[WARNING] The POM for bouncycastle:bcprov-jdk14:jar:140 is invalid, transitive dependencies
(if any) will not be available, enable debug logging for more details
[INFO] 
[INFO] --- maven-clean-plugin:2.5:clean (default-clean) @ cloud-awsapi ---
[INFO] Deleting <http://jenkins.buildacloud.org/job/build-master-noredist/ws/awsapi/target>
(includes = [**/*], excludes = [])
[INFO] Deleting <http://jenkins.buildacloud.org/job/build-master-noredist/ws/awsapi>
(includes = [target, dist], excludes = [])
[INFO] 
[INFO] --- maven-remote-resources-plugin:1.3:process (default) @ cloud-awsapi ---
[WARNING] Invalid POM for org.apache.rampart:rampart-policy:jar:1.5.1, transitive dependencies
(if any) will not be available, enable debug logging for more details
[WARNING] Invalid POM for org.apache.rampart:rampart-trust:jar:1.5.1, transitive dependencies
(if any) will not be available, enable debug logging for more details
[WARNING] Invalid POM for org.apache.axis2:axis2-kernel:jar:1.5.4, transitive dependencies
(if any) will not be available, enable debug logging for more details
[WARNING] Invalid POM for org.apache.axis2:mex:jar:impl:1.5.4, transitive dependencies (if
any) will not be available, enable debug logging for more details
[WARNING] Invalid POM for org.apache.axis2:axis2-mtompolicy:jar:1.5.4, transitive dependencies
(if any) will not be available, enable debug logging for more details
[WARNING] Invalid POM for org.apache.axis2:addressing:mar:1.5.4, transitive dependencies (if
any) will not be available, enable debug logging for more details
[WARNING] Invalid POM for org.apache.ws.commons.axiom:axiom-dom:jar:1.2.10, transitive dependencies
(if any) will not be available, enable debug logging for more details
[WARNING] Invalid POM for org.apache.ws.security:wss4j:jar:1.5.10, transitive dependencies
(if any) will not be available, enable debug logging for more details
[WARNING] Invalid POM for org.apache.santuario:xmlsec:jar:1.4.2, transitive dependencies (if
any) will not be available, enable debug logging for more details
[WARNING] Invalid POM for org.opensaml:opensaml1:jar:1.1, transitive dependencies (if any)
will not be available, enable debug logging for more details
[WARNING] Invalid POM for org.slf4j:slf4j-jdk14:jar:1.5.2, transitive dependencies (if any)
will not be available, enable debug logging for more details
[WARNING] Invalid POM for commons-lang:commons-lang:jar:2.3, transitive dependencies (if any)
will not be available, enable debug logging for more details
[WARNING] Invalid POM for org.apache.rampart:rampart-policy:jar:1.5.1, transitive dependencies
(if any) will not be available, enable debug logging for more details
[WARNING] Invalid POM for org.apache.rampart:rampart-trust:jar:1.5.1, transitive dependencies
(if any) will not be available, enable debug logging for more details
[WARNING] Invalid POM for org.apache.axis2:axis2-kernel:jar:1.5.4, transitive dependencies
(if any) will not be available, enable debug logging for more details
[WARNING] Invalid POM for org.apache.axis2:mex:jar:impl:1.5.4, transitive dependencies (if
any) will not be available, enable debug logging for more details
[WARNING] Invalid POM for org.apache.axis2:axis2-mtompolicy:jar:1.5.4, transitive dependencies
(if any) will not be available, enable debug logging for more details
[WARNING] Invalid POM for org.apache.axis2:addressing:mar:1.5.4, transitive dependencies (if
any) will not be available, enable debug logging for more details
[WARNING] Invalid POM for org.apache.ws.commons.axiom:axiom-dom:jar:1.2.10, transitive dependencies
(if any) will not be available, enable debug logging for more details
[WARNING] Invalid POM for org.apache.ws.security:wss4j:jar:1.5.10, transitive dependencies
(if any) will not be available, enable debug logging for more details
[WARNING] Invalid POM for org.apache.santuario:xmlsec:jar:1.4.2, transitive dependencies (if
any) will not be available, enable debug logging for more details
[WARNING] Invalid POM for org.opensaml:opensaml1:jar:1.1, transitive dependencies (if any)
will not be available, enable debug logging for more details
[WARNING] Invalid POM for org.slf4j:slf4j-jdk14:jar:1.5.2, transitive dependencies (if any)
will not be available, enable debug logging for more details
[WARNING] Invalid POM for commons-lang:commons-lang:jar:2.3, transitive dependencies (if any)
will not be available, enable debug logging for more details
[WARNING] Invalid POM for bouncycastle:bcprov-jdk14:jar:140, transitive dependencies (if any)
will not be available, enable debug logging for more details
[WARNING] Invalid POM for org.apache.rampart:rampart-policy:jar:1.5.1, transitive dependencies
(if any) will not be available, enable debug logging for more details
[WARNING] Invalid POM for org.apache.rampart:rampart-trust:jar:1.5.1, transitive dependencies
(if any) will not be available, enable debug logging for more details
[WARNING] Invalid POM for org.apache.santuario:xmlsec:jar:1.4.2, transitive dependencies (if
any) will not be available, enable debug logging for more details
[WARNING] Invalid project model for artifact [addressing:org.apache.axis2:1.5.4]. It will
be ignored by the remote resources Mojo.
[WARNING] Invalid project model for artifact [bcprov-jdk14:bouncycastle:140]. It will be ignored
by the remote resources Mojo.
[WARNING] Invalid project model for artifact [opensaml1:org.opensaml:1.1]. It will be ignored
by the remote resources Mojo.
[WARNING] Invalid project model for artifact [commons-lang:commons-lang:2.3]. It will be ignored
by the remote resources Mojo.
[WARNING] Invalid project model for artifact [rampart-trust:org.apache.rampart:1.5.1]. It
will be ignored by the remote resources Mojo.
[WARNING] Invalid project model for artifact [rampart-policy:org.apache.rampart:1.5.1]. It
will be ignored by the remote resources Mojo.
[WARNING] Invalid project model for artifact [xmlsec:org.apache.santuario:1.4.2]. It will
be ignored by the remote resources Mojo.
[WARNING] Invalid project model for artifact [mex:org.apache.axis2:1.5.4]. It will be ignored
by the remote resources Mojo.
[WARNING] Invalid project model for artifact [axiom-dom:org.apache.ws.commons.axiom:1.2.10].
It will be ignored by the remote resources Mojo.
[WARNING] Invalid project model for artifact [axis2-mtompolicy:org.apache.axis2:1.5.4]. It
will be ignored by the remote resources Mojo.
[INFO] 
[INFO] --- maven-antrun-plugin:1.7:run (generate-resource) @ cloud-awsapi ---
[INFO] Executing tasks

main:
     [copy] Copying 3 files to <http://jenkins.buildacloud.org/job/build-master-noredist/ws/awsapi/target/generated-webapp/WEB-INF/classes>
[INFO] Executed tasks
[INFO] 
[INFO] --- maven-resources-plugin:2.5:resources (default-resources) @ cloud-awsapi ---
[debug] execute contextualize
[INFO] Using 'UTF-8' encoding to copy filtered resources.
[INFO] Copying 2 resources
[INFO] Copying 2 resources
[INFO] Copying 3 resources
[INFO] Copying 3 resources
[INFO] 
[INFO] --- maven-compiler-plugin:2.5.1:compile (default-compile) @ cloud-awsapi ---
[INFO] Compiling 1295 source files to <http://jenkins.buildacloud.org/job/build-master-noredist/ws/awsapi/target/classes>
[INFO] -------------------------------------------------------------
[ERROR] COMPILATION ERROR : 
[INFO] -------------------------------------------------------------
[ERROR] error: error reading /jenkins/.m2/repository/org/apache/axis2/mex/1.5.4/mex-1.5.4-impl.jar;
error in opening zip file
[ERROR] error: error reading /jenkins/.m2/repository/org/apache/axis2/axis2-mtompolicy/1.5.4/axis2-mtompolicy-1.5.4.jar;
error in opening zip file
[ERROR] error: error reading /jenkins/.m2/repository/org/apache/ws/commons/axiom/axiom-dom/1.2.10/axiom-dom-1.2.10.jar;
error in opening zip file
[ERROR] error: error reading /jenkins/.m2/repository/org/opensaml/opensaml1/1.1/opensaml1-1.1.jar;
error in opening zip file
[ERROR] error: error reading /jenkins/.m2/repository/commons-lang/commons-lang/2.3/commons-lang-2.3.jar;
error in opening zip file
[INFO] 5 errors 
[INFO] -------------------------------------------------------------
[INFO] ------------------------------------------------------------------------
[INFO] Reactor Summary:
[INFO] 
[INFO] Apache CloudStack Developer Tools - Checkstyle Configuration  SUCCESS [2.297s]
[INFO] Apache CloudStack ................................. SUCCESS [3.249s]
[INFO] Apache CloudStack Maven Conventions Parent ........ SUCCESS [1.694s]
[INFO] Apache CloudStack Framework - Managed Context ..... SUCCESS [4.840s]
[INFO] Apache CloudStack Utils ........................... SUCCESS [17.923s]
[INFO] Apache CloudStack Framework ....................... SUCCESS [1.887s]
[INFO] Apache CloudStack Framework - Event Notification .. SUCCESS [10.907s]
[INFO] Apache CloudStack Framework - Configuration ....... SUCCESS [5.310s]
[INFO] Apache CloudStack API ............................. SUCCESS [21.376s]
[INFO] Apache CloudStack Framework - REST ................ SUCCESS [3.162s]
[INFO] Apache CloudStack Framework - IPC ................. SUCCESS [7.434s]
[INFO] Apache CloudStack Cloud Engine .................... SUCCESS [4.590s]
[INFO] Apache CloudStack Cloud Engine API ................ SUCCESS [6.106s]
[INFO] Apache CloudStack Framework - Security ............ SUCCESS [3.487s]
[INFO] Apache CloudStack Core ............................ SUCCESS [13.509s]
[INFO] Apache CloudStack Agents .......................... SUCCESS [8.845s]
[INFO] Apache CloudStack Framework - Clustering .......... SUCCESS [4.205s]
[INFO] Apache CloudStack Framework - Jobs ................ SUCCESS [5.951s]
[INFO] Apache CloudStack Cloud Engine Schema Component ... SUCCESS [16.840s]
[INFO] Apache CloudStack Framework - Event Notification .. SUCCESS [2.238s]
[INFO] Apache CloudStack Cloud Engine Internal Components API  SUCCESS [6.552s]
[INFO] Apache CloudStack Server .......................... SUCCESS [1:04.882s]
[INFO] Apache CloudStack Usage Server .................... SUCCESS [8.814s]
[INFO] Apache XenSource XAPI ............................. SUCCESS [9.588s]
[INFO] Apache CloudStack Cloud Engine Orchestration Component  SUCCESS [14.315s]
[INFO] Apache CloudStack Cloud Services .................. SUCCESS [1.792s]
[INFO] Apache CloudStack Secondary Storage Service ....... SUCCESS [8.642s]
[INFO] Apache CloudStack Engine Storage Component ........ SUCCESS [9.203s]
[INFO] Apache CloudStack Engine Storage Volume Component . SUCCESS [5.864s]
[INFO] Apache CloudStack Engine Storage Image Component .. SUCCESS [5.098s]
[INFO] Apache CloudStack Engine Storage Data Motion Component  SUCCESS [3.448s]
[INFO] Apache CloudStack Engine Storage Cache Component .. SUCCESS [2.959s]
[INFO] Apache CloudStack Engine Storage Snapshot Component  SUCCESS [11.571s]
[INFO] Apache CloudStack Cloud Engine API ................ SUCCESS [2.480s]
[INFO] Apache CloudStack Cloud Engine Service ............ SUCCESS [4.537s]
[INFO] Apache CloudStack Plugin POM ...................... SUCCESS [3.609s]
[INFO] Apache CloudStack Plugin - API Rate Limit ......... SUCCESS [7.826s]
[INFO] Apache CloudStack Plugin - API Discovery .......... SUCCESS [5.651s]
[INFO] Apache CloudStack Plugin - ACL Static Role Based .. SUCCESS [2.907s]
[INFO] Apache CloudStack Plugin - Host Anti-Affinity Processor  SUCCESS [2.791s]
[INFO] Apache CloudStack Plugin - Explicit Dedication Processor  SUCCESS [3.087s]
[INFO] Apache CloudStack Plugin - User Concentrated Pod Deployment Planner  SUCCESS [2.817s]
[INFO] Apache CloudStack Plugin - User Dispersing Deployment Planner  SUCCESS [2.987s]
[INFO] Apache CloudStack Plugin - Implicit Dedication Planner  SUCCESS [9.762s]
[INFO] Apache CloudStack Plugin - Skip Heurestics Planner  SUCCESS [2.944s]
[INFO] Apache CloudStack Plugin - Host Allocator Random .. SUCCESS [3.275s]
[INFO] Apache CloudStack Plugin - Dedicated Resources .... SUCCESS [8.989s]
[INFO] Apache CloudStack Plugin - Hypervisor OracleVM .... SUCCESS [4.583s]
[INFO] Apache CloudStack Plugin - Open vSwitch ........... SUCCESS [3.864s]
[INFO] Apache CloudStack Plugin - Hypervisor Xen ......... SUCCESS [14.146s]
[INFO] Apache CloudStack Plugin - Hypervisor KVM ......... SUCCESS [12.705s]
[INFO] Apache CloudStack Plugin - RabbitMQ Event Bus ..... SUCCESS [2.980s]
[INFO] Apache CloudStack Plugin - In Memory Event Bus .... SUCCESS [2.742s]
[INFO] Apache CloudStack Plugin - Hypervisor Baremetal ... SUCCESS [6.000s]
[INFO] Apache CloudStack Plugin - Hypervisor UCS ......... SUCCESS [3.578s]
[INFO] Apache CloudStack Plugin - Hypervisor Hyper-V ..... SUCCESS [8.168s]
[INFO] Apache CloudStack Plugin - Network Elastic Load Balancer  SUCCESS [3.942s]
[INFO] Apache CloudStack Plugin - Network Internal Load Balancer  SUCCESS [12.361s]
[INFO] Apache CloudStack Plugin - Network Juniper Contrail  SUCCESS [13.227s]
[INFO] Apache CloudStack Plugin - Palo Alto .............. SUCCESS [10.592s]
[INFO] Apache CloudStack Plugin - Network Nicira NVP ..... SUCCESS [12.935s]
[INFO] Apache CloudStack Plugin - BigSwitch Virtual Network Segment  SUCCESS [7.489s]
[INFO] Apache CloudStack Plugin - Midokura Midonet ....... SUCCESS [7.459s]
[INFO] Apache CloudStack Plugin - Stratosphere SSP ....... SUCCESS [7.589s]
[INFO] Apache CloudStack Plugin - Network Opendaylight ... SUCCESS [8.108s]
[INFO] Apache CloudStack Plugin - Storage Allocator Random  SUCCESS [2.712s]
[INFO] Apache CloudStack Plugin - User Authenticator LDAP  SUCCESS [4.173s]
[INFO] Apache CloudStack Plugin - User Authenticator MD5 . SUCCESS [2.736s]
[INFO] Apache CloudStack Plugin - User Authenticator Plain Text  SUCCESS [2.659s]
[INFO] Apache CloudStack Plugin - User Authenticator SHA256 Salted  SUCCESS [5.586s]
[INFO] Apache CloudStack Plugin - Dns Notifier Example ... SUCCESS [2.612s]
[INFO] Apache CloudStack Plugin - Storage Image S3 ....... SUCCESS [3.154s]
[INFO] Apache CloudStack Plugin - Storage Image Swift provider  SUCCESS [3.062s]
[INFO] Apache CloudStack Plugin - Storage Image default provider  SUCCESS [2.627s]
[INFO] Apache CloudStack Plugin - Storage Image sample provider  SUCCESS [2.339s]
[INFO] Apache CloudStack Plugin - Storage Volume Nexenta Provider  SUCCESS [5.446s]
[INFO] Apache CloudStack Plugin - Storage Volume SolidFire Provider  SUCCESS [5.507s]
[INFO] Apache CloudStack Plugin - Storage Volume default provider  SUCCESS [3.384s]
[INFO] Apache CloudStack Plugin - Storage Volume sample provider  SUCCESS [2.901s]
[INFO] Apache CloudStack Plugin - SNMP Alerts ............ SUCCESS [5.420s]
[INFO] Apache CloudStack Plugin - Syslog Alerts .......... SUCCESS [5.077s]
[INFO] Apache CloudStack Plugin - Network VXLAN .......... SUCCESS [6.287s]
[INFO] Apache CloudStack Framework - Spring Life Cycle ... SUCCESS [2.885s]
[INFO] Apache CloudStack Framework - Spring Module ....... SUCCESS [9.056s]
[INFO] Apache CloudStack Console Proxy - RDP Client ...... SUCCESS [9.743s]
[INFO] Apache CloudStack Console Proxy ................... SUCCESS [0.235s]
[INFO] Apache CloudStack Console Proxy - Server .......... SUCCESS [4.597s]
[INFO] Apache CloudStack System VM ....................... SUCCESS [6.921s]
[INFO] Apache CloudStack Client UI ....................... SUCCESS [10.417s]
[INFO] Apache CloudStack Framework - QuickCloud .......... SUCCESS [0.489s]
[INFO] Apache CloudStack AWS API Bridge .................. FAILURE [7.483s]
[INFO] ------------------------------------------------------------------------
[INFO] BUILD FAILURE
[INFO] ------------------------------------------------------------------------
[INFO] Total time: 10:26.273s
[INFO] Finished at: Mon Jan 27 20:20:32 CET 2014
[INFO] Final Memory: 87M/214M
[INFO] ------------------------------------------------------------------------
[ERROR] Failed to execute goal org.apache.maven.plugins:maven-compiler-plugin:2.5.1:compile
(default-compile) on project cloud-awsapi: Compilation failure: Compilation failure:
[ERROR] error: error reading /jenkins/.m2/repository/org/apache/axis2/mex/1.5.4/mex-1.5.4-impl.jar;
error in opening zip file
[ERROR] error: error reading /jenkins/.m2/repository/org/apache/axis2/axis2-mtompolicy/1.5.4/axis2-mtompolicy-1.5.4.jar;
error in opening zip file
[ERROR] error: error reading /jenkins/.m2/repository/org/apache/ws/commons/axiom/axiom-dom/1.2.10/axiom-dom-1.2.10.jar;
error in opening zip file
[ERROR] error: error reading /jenkins/.m2/repository/org/opensaml/opensaml1/1.1/opensaml1-1.1.jar;
error in opening zip file
[ERROR] error: error reading /jenkins/.m2/repository/commons-lang/commons-lang/2.3/commons-lang-2.3.jar;
error in opening zip file
[ERROR] -> [Help 1]
[ERROR] 
[ERROR] To see the full stack trace of the errors, re-run Maven with the -e switch.
[ERROR] Re-run Maven using the -X switch to enable full debug logging.
[ERROR] 
[ERROR] For more information about the errors and possible solutions, please read the following
articles:
[ERROR] [Help 1] http://cwiki.apache.org/confluence/display/MAVEN/MojoFailureException
[ERROR] 
[ERROR] After correcting the problems, you can resume the build with the command
[ERROR]   mvn <goals> -rf :cloud-awsapi
Build step 'Invoke top-level Maven targets' marked build as failure
Archiving artifacts
Skipping Cobertura coverage report as build was not SUCCESS or better ...

Mime
View raw message