cloudstack-dev mailing list archives

Site index · List index
Message view « Date » · « Thread »
Top « Date » · « Thread »
From jenk...@cloudstack.org
Subject Build failed in Jenkins: build-master-noredist #2159
Date Fri, 24 Jan 2014 10:49:55 GMT
See <http://jenkins.buildacloud.org/job/build-master-noredist/2159/>

------------------------------------------
[...truncated 5499 lines...]
[INFO] --- maven-remote-resources-plugin:1.3:process (default) @ cloud-quickcloud ---
[INFO] 
[INFO] --- maven-resources-plugin:2.5:resources (default-resources) @ cloud-quickcloud ---
[debug] execute contextualize
[INFO] Using 'UTF-8' encoding to copy filtered resources.
[INFO] Copying 1 resource
[INFO] Copying 3 resources
[INFO] 
[INFO] --- maven-compiler-plugin:2.5.1:compile (default-compile) @ cloud-quickcloud ---
[INFO] No sources to compile
[INFO] 
[INFO] --- maven-resources-plugin:2.5:testResources (default-testResources) @ cloud-quickcloud
---
[debug] execute contextualize
[INFO] Using 'UTF-8' encoding to copy filtered resources.
[INFO] skip non existing resourceDirectory <http://jenkins.buildacloud.org/job/build-master-noredist/ws/quickcloud/src/test/resources>
[INFO] Copying 3 resources
[INFO] 
[INFO] --- maven-compiler-plugin:2.5.1:testCompile (default-testCompile) @ cloud-quickcloud
---
[INFO] No sources to compile
[INFO] 
[INFO] --- maven-surefire-plugin:2.12:test (default-test) @ cloud-quickcloud ---
[INFO] Surefire report directory: <http://jenkins.buildacloud.org/job/build-master-noredist/ws/quickcloud/target/surefire-reports>

-------------------------------------------------------
 T E S T S
-------------------------------------------------------

Results :

Tests run: 0, Failures: 0, Errors: 0, Skipped: 0

[INFO] 
[INFO] --- maven-jar-plugin:2.4:jar (default-jar) @ cloud-quickcloud ---
[INFO] Building jar: <http://jenkins.buildacloud.org/job/build-master-noredist/ws/quickcloud/target/cloud-quickcloud-4.4.0-SNAPSHOT.jar>
[INFO] 
[INFO] --- maven-site-plugin:3.3:attach-descriptor (attach-descriptor) @ cloud-quickcloud
---
[INFO] 
[INFO] --- maven-install-plugin:2.3.1:install (default-install) @ cloud-quickcloud ---
[INFO] Installing <http://jenkins.buildacloud.org/job/build-master-noredist/ws/quickcloud/target/cloud-quickcloud-4.4.0-SNAPSHOT.jar>
to /jenkins/.m2/repository/org/apache/cloudstack/cloud-quickcloud/4.4.0-SNAPSHOT/cloud-quickcloud-4.4.0-SNAPSHOT.jar
[INFO] Installing <http://jenkins.buildacloud.org/job/build-master-noredist/ws/quickcloud/pom.xml>
to /jenkins/.m2/repository/org/apache/cloudstack/cloud-quickcloud/4.4.0-SNAPSHOT/cloud-quickcloud-4.4.0-SNAPSHOT.pom
[INFO]                                                                         
[INFO] ------------------------------------------------------------------------
[INFO] Building Apache CloudStack AWS API Bridge 4.4.0-SNAPSHOT
[INFO] ------------------------------------------------------------------------
[WARNING] The POM for org.apache.rampart:rampart-policy:jar:1.5.1 is invalid, transitive dependencies
(if any) will not be available, enable debug logging for more details
[WARNING] The POM for org.apache.rampart:rampart-trust:jar:1.5.1 is invalid, transitive dependencies
(if any) will not be available, enable debug logging for more details
[WARNING] The POM for org.apache.axis2:axis2-kernel:jar:1.5.4 is invalid, transitive dependencies
(if any) will not be available, enable debug logging for more details
[WARNING] The POM for org.apache.axis2:mex:jar:impl:1.5.4 is invalid, transitive dependencies
(if any) will not be available, enable debug logging for more details
[WARNING] The POM for org.apache.axis2:axis2-mtompolicy:jar:1.5.4 is invalid, transitive dependencies
(if any) will not be available, enable debug logging for more details
[WARNING] The POM for org.apache.axis2:addressing:mar:1.5.4 is invalid, transitive dependencies
(if any) will not be available, enable debug logging for more details
[WARNING] The POM for org.apache.ws.commons.axiom:axiom-dom:jar:1.2.10 is invalid, transitive
dependencies (if any) will not be available, enable debug logging for more details
[WARNING] The POM for org.apache.ws.security:wss4j:jar:1.5.10 is invalid, transitive dependencies
(if any) will not be available, enable debug logging for more details
[WARNING] The POM for org.apache.santuario:xmlsec:jar:1.4.2 is invalid, transitive dependencies
(if any) will not be available, enable debug logging for more details
[WARNING] The POM for org.opensaml:opensaml1:jar:1.1 is invalid, transitive dependencies (if
any) will not be available, enable debug logging for more details
[WARNING] The POM for org.slf4j:slf4j-jdk14:jar:1.5.2 is invalid, transitive dependencies
(if any) will not be available, enable debug logging for more details
[WARNING] The POM for commons-lang:commons-lang:jar:2.3 is invalid, transitive dependencies
(if any) will not be available, enable debug logging for more details
[WARNING] The POM for bouncycastle:bcprov-jdk14:jar:140 is invalid, transitive dependencies
(if any) will not be available, enable debug logging for more details
[INFO] 
[INFO] --- maven-clean-plugin:2.5:clean (default-clean) @ cloud-awsapi ---
[INFO] Deleting <http://jenkins.buildacloud.org/job/build-master-noredist/ws/awsapi/target>
(includes = [**/*], excludes = [])
[INFO] Deleting <http://jenkins.buildacloud.org/job/build-master-noredist/ws/awsapi>
(includes = [target, dist], excludes = [])
[INFO] 
[INFO] --- maven-remote-resources-plugin:1.3:process (default) @ cloud-awsapi ---
[WARNING] Invalid POM for org.apache.rampart:rampart-policy:jar:1.5.1, transitive dependencies
(if any) will not be available, enable debug logging for more details
[WARNING] Invalid POM for org.apache.rampart:rampart-trust:jar:1.5.1, transitive dependencies
(if any) will not be available, enable debug logging for more details
[WARNING] Invalid POM for org.apache.axis2:axis2-kernel:jar:1.5.4, transitive dependencies
(if any) will not be available, enable debug logging for more details
[WARNING] Invalid POM for org.apache.axis2:mex:jar:impl:1.5.4, transitive dependencies (if
any) will not be available, enable debug logging for more details
[WARNING] Invalid POM for org.apache.axis2:axis2-mtompolicy:jar:1.5.4, transitive dependencies
(if any) will not be available, enable debug logging for more details
[WARNING] Invalid POM for org.apache.axis2:addressing:mar:1.5.4, transitive dependencies (if
any) will not be available, enable debug logging for more details
[WARNING] Invalid POM for org.apache.ws.commons.axiom:axiom-dom:jar:1.2.10, transitive dependencies
(if any) will not be available, enable debug logging for more details
[WARNING] Invalid POM for org.apache.ws.security:wss4j:jar:1.5.10, transitive dependencies
(if any) will not be available, enable debug logging for more details
[WARNING] Invalid POM for org.apache.santuario:xmlsec:jar:1.4.2, transitive dependencies (if
any) will not be available, enable debug logging for more details
[WARNING] Invalid POM for org.opensaml:opensaml1:jar:1.1, transitive dependencies (if any)
will not be available, enable debug logging for more details
[WARNING] Invalid POM for org.slf4j:slf4j-jdk14:jar:1.5.2, transitive dependencies (if any)
will not be available, enable debug logging for more details
[WARNING] Invalid POM for commons-lang:commons-lang:jar:2.3, transitive dependencies (if any)
will not be available, enable debug logging for more details
[WARNING] Invalid POM for org.apache.rampart:rampart-policy:jar:1.5.1, transitive dependencies
(if any) will not be available, enable debug logging for more details
[WARNING] Invalid POM for org.apache.rampart:rampart-trust:jar:1.5.1, transitive dependencies
(if any) will not be available, enable debug logging for more details
[WARNING] Invalid POM for org.apache.axis2:axis2-kernel:jar:1.5.4, transitive dependencies
(if any) will not be available, enable debug logging for more details
[WARNING] Invalid POM for org.apache.axis2:mex:jar:impl:1.5.4, transitive dependencies (if
any) will not be available, enable debug logging for more details
[WARNING] Invalid POM for org.apache.axis2:axis2-mtompolicy:jar:1.5.4, transitive dependencies
(if any) will not be available, enable debug logging for more details
[WARNING] Invalid POM for org.apache.axis2:addressing:mar:1.5.4, transitive dependencies (if
any) will not be available, enable debug logging for more details
[WARNING] Invalid POM for org.apache.ws.commons.axiom:axiom-dom:jar:1.2.10, transitive dependencies
(if any) will not be available, enable debug logging for more details
[WARNING] Invalid POM for org.apache.ws.security:wss4j:jar:1.5.10, transitive dependencies
(if any) will not be available, enable debug logging for more details
[WARNING] Invalid POM for org.apache.santuario:xmlsec:jar:1.4.2, transitive dependencies (if
any) will not be available, enable debug logging for more details
[WARNING] Invalid POM for org.opensaml:opensaml1:jar:1.1, transitive dependencies (if any)
will not be available, enable debug logging for more details
[WARNING] Invalid POM for org.slf4j:slf4j-jdk14:jar:1.5.2, transitive dependencies (if any)
will not be available, enable debug logging for more details
[WARNING] Invalid POM for commons-lang:commons-lang:jar:2.3, transitive dependencies (if any)
will not be available, enable debug logging for more details
[WARNING] Invalid POM for bouncycastle:bcprov-jdk14:jar:140, transitive dependencies (if any)
will not be available, enable debug logging for more details
[WARNING] Invalid POM for org.apache.rampart:rampart-policy:jar:1.5.1, transitive dependencies
(if any) will not be available, enable debug logging for more details
[WARNING] Invalid POM for org.apache.rampart:rampart-trust:jar:1.5.1, transitive dependencies
(if any) will not be available, enable debug logging for more details
[WARNING] Invalid POM for org.apache.santuario:xmlsec:jar:1.4.2, transitive dependencies (if
any) will not be available, enable debug logging for more details
[WARNING] Invalid project model for artifact [addressing:org.apache.axis2:1.5.4]. It will
be ignored by the remote resources Mojo.
[WARNING] Invalid project model for artifact [bcprov-jdk14:bouncycastle:140]. It will be ignored
by the remote resources Mojo.
[WARNING] Invalid project model for artifact [opensaml1:org.opensaml:1.1]. It will be ignored
by the remote resources Mojo.
[WARNING] Invalid project model for artifact [commons-lang:commons-lang:2.3]. It will be ignored
by the remote resources Mojo.
[WARNING] Invalid project model for artifact [rampart-trust:org.apache.rampart:1.5.1]. It
will be ignored by the remote resources Mojo.
[WARNING] Invalid project model for artifact [rampart-policy:org.apache.rampart:1.5.1]. It
will be ignored by the remote resources Mojo.
[WARNING] Invalid project model for artifact [xmlsec:org.apache.santuario:1.4.2]. It will
be ignored by the remote resources Mojo.
[WARNING] Invalid project model for artifact [mex:org.apache.axis2:1.5.4]. It will be ignored
by the remote resources Mojo.
[WARNING] Invalid project model for artifact [axiom-dom:org.apache.ws.commons.axiom:1.2.10].
It will be ignored by the remote resources Mojo.
[WARNING] Invalid project model for artifact [axis2-mtompolicy:org.apache.axis2:1.5.4]. It
will be ignored by the remote resources Mojo.
[INFO] 
[INFO] --- maven-antrun-plugin:1.7:run (generate-resource) @ cloud-awsapi ---
[INFO] Executing tasks

main:
     [copy] Copying 3 files to <http://jenkins.buildacloud.org/job/build-master-noredist/ws/awsapi/target/generated-webapp/WEB-INF/classes>
[INFO] Executed tasks
[INFO] 
[INFO] --- maven-resources-plugin:2.5:resources (default-resources) @ cloud-awsapi ---
[debug] execute contextualize
[INFO] Using 'UTF-8' encoding to copy filtered resources.
[INFO] Copying 2 resources
[INFO] Copying 2 resources
[INFO] Copying 3 resources
[INFO] Copying 3 resources
[INFO] 
[INFO] --- maven-compiler-plugin:2.5.1:compile (default-compile) @ cloud-awsapi ---
[INFO] Compiling 1295 source files to <http://jenkins.buildacloud.org/job/build-master-noredist/ws/awsapi/target/classes>
[INFO] -------------------------------------------------------------
[ERROR] COMPILATION ERROR : 
[INFO] -------------------------------------------------------------
[ERROR] error: error reading /jenkins/.m2/repository/org/apache/axis2/mex/1.5.4/mex-1.5.4-impl.jar;
error in opening zip file
[ERROR] error: error reading /jenkins/.m2/repository/org/apache/axis2/axis2-mtompolicy/1.5.4/axis2-mtompolicy-1.5.4.jar;
error in opening zip file
[ERROR] error: error reading /jenkins/.m2/repository/org/apache/ws/commons/axiom/axiom-dom/1.2.10/axiom-dom-1.2.10.jar;
error in opening zip file
[ERROR] error: error reading /jenkins/.m2/repository/org/opensaml/opensaml1/1.1/opensaml1-1.1.jar;
error in opening zip file
[ERROR] error: error reading /jenkins/.m2/repository/commons-lang/commons-lang/2.3/commons-lang-2.3.jar;
error in opening zip file
[INFO] 5 errors 
[INFO] -------------------------------------------------------------
[INFO] ------------------------------------------------------------------------
[INFO] Reactor Summary:
[INFO] 
[INFO] Apache CloudStack Developer Tools - Checkstyle Configuration  SUCCESS [2.743s]
[INFO] Apache CloudStack ................................. SUCCESS [2.778s]
[INFO] Apache CloudStack Maven Conventions Parent ........ SUCCESS [1.730s]
[INFO] Apache CloudStack Framework - Managed Context ..... SUCCESS [4.687s]
[INFO] Apache CloudStack Utils ........................... SUCCESS [17.727s]
[INFO] Apache CloudStack Framework ....................... SUCCESS [1.924s]
[INFO] Apache CloudStack Framework - Event Notification .. SUCCESS [10.581s]
[INFO] Apache CloudStack Framework - Configuration ....... SUCCESS [5.919s]
[INFO] Apache CloudStack API ............................. SUCCESS [20.351s]
[INFO] Apache CloudStack Framework - REST ................ SUCCESS [3.963s]
[INFO] Apache CloudStack Framework - IPC ................. SUCCESS [7.913s]
[INFO] Apache CloudStack Cloud Engine .................... SUCCESS [4.711s]
[INFO] Apache CloudStack Cloud Engine API ................ SUCCESS [6.194s]
[INFO] Apache CloudStack Framework - Security ............ SUCCESS [3.403s]
[INFO] Apache CloudStack Core ............................ SUCCESS [11.805s]
[INFO] Apache CloudStack Agents .......................... SUCCESS [8.714s]
[INFO] Apache CloudStack Framework - Clustering .......... SUCCESS [5.187s]
[INFO] Apache CloudStack Framework - Jobs ................ SUCCESS [5.668s]
[INFO] Apache CloudStack Cloud Engine Schema Component ... SUCCESS [16.908s]
[INFO] Apache CloudStack Framework - Event Notification .. SUCCESS [2.878s]
[INFO] Apache CloudStack Cloud Engine Internal Components API  SUCCESS [4.341s]
[INFO] Apache CloudStack Server .......................... SUCCESS [1:01.232s]
[INFO] Apache CloudStack Usage Server .................... SUCCESS [9.063s]
[INFO] Apache XenSource XAPI ............................. SUCCESS [8.352s]
[INFO] Apache CloudStack Cloud Engine Orchestration Component  SUCCESS [12.459s]
[INFO] Apache CloudStack Cloud Services .................. SUCCESS [1.636s]
[INFO] Apache CloudStack Secondary Storage Service ....... SUCCESS [8.336s]
[INFO] Apache CloudStack Engine Storage Component ........ SUCCESS [8.898s]
[INFO] Apache CloudStack Engine Storage Volume Component . SUCCESS [6.088s]
[INFO] Apache CloudStack Engine Storage Image Component .. SUCCESS [5.970s]
[INFO] Apache CloudStack Engine Storage Data Motion Component  SUCCESS [3.585s]
[INFO] Apache CloudStack Engine Storage Cache Component .. SUCCESS [3.739s]
[INFO] Apache CloudStack Engine Storage Snapshot Component  SUCCESS [10.044s]
[INFO] Apache CloudStack Cloud Engine API ................ SUCCESS [4.903s]
[INFO] Apache CloudStack Cloud Engine Service ............ SUCCESS [5.532s]
[INFO] Apache CloudStack Plugin POM ...................... SUCCESS [3.325s]
[INFO] Apache CloudStack Plugin - API Rate Limit ......... SUCCESS [8.095s]
[INFO] Apache CloudStack Plugin - API Discovery .......... SUCCESS [5.971s]
[INFO] Apache CloudStack Plugin - ACL Static Role Based .. SUCCESS [3.673s]
[INFO] Apache CloudStack Plugin - Host Anti-Affinity Processor  SUCCESS [3.621s]
[INFO] Apache CloudStack Plugin - Explicit Dedication Processor  SUCCESS [3.731s]
[INFO] Apache CloudStack Plugin - User Concentrated Pod Deployment Planner  SUCCESS [3.602s]
[INFO] Apache CloudStack Plugin - User Dispersing Deployment Planner  SUCCESS [3.428s]
[INFO] Apache CloudStack Plugin - Implicit Dedication Planner  SUCCESS [10.337s]
[INFO] Apache CloudStack Plugin - Skip Heurestics Planner  SUCCESS [3.584s]
[INFO] Apache CloudStack Plugin - Host Allocator Random .. SUCCESS [3.579s]
[INFO] Apache CloudStack Plugin - Dedicated Resources .... SUCCESS [9.378s]
[INFO] Apache CloudStack Plugin - Hypervisor OracleVM .... SUCCESS [4.886s]
[INFO] Apache CloudStack Plugin - Open vSwitch ........... SUCCESS [4.716s]
[INFO] Apache CloudStack Plugin - Hypervisor Xen ......... SUCCESS [12.652s]
[INFO] Apache CloudStack Plugin - Hypervisor KVM ......... SUCCESS [11.491s]
[INFO] Apache CloudStack Plugin - RabbitMQ Event Bus ..... SUCCESS [3.627s]
[INFO] Apache CloudStack Plugin - In Memory Event Bus .... SUCCESS [3.297s]
[INFO] Apache CloudStack Plugin - Hypervisor Baremetal ... SUCCESS [5.696s]
[INFO] Apache CloudStack Plugin - Hypervisor UCS ......... SUCCESS [4.137s]
[INFO] Apache CloudStack Plugin - Hypervisor Hyper-V ..... SUCCESS [8.773s]
[INFO] Apache CloudStack Plugin - Network Elastic Load Balancer  SUCCESS [4.554s]
[INFO] Apache CloudStack Plugin - Network Internal Load Balancer  SUCCESS [12.118s]
[INFO] Apache CloudStack Plugin - Network Juniper Contrail  SUCCESS [13.189s]
[INFO] Apache CloudStack Plugin - Palo Alto .............. SUCCESS [9.591s]
[INFO] Apache CloudStack Plugin - Network Nicira NVP ..... SUCCESS [11.690s]
[INFO] Apache CloudStack Plugin - BigSwitch Virtual Network Segment  SUCCESS [7.802s]
[INFO] Apache CloudStack Plugin - Midokura Midonet ....... SUCCESS [8.646s]
[INFO] Apache CloudStack Plugin - Stratosphere SSP ....... SUCCESS [8.187s]
[INFO] Apache CloudStack Plugin - Network Opendaylight ... SUCCESS [7.443s]
[INFO] Apache CloudStack Plugin - Storage Allocator Random  SUCCESS [4.294s]
[INFO] Apache CloudStack Plugin - User Authenticator LDAP  SUCCESS [5.100s]
[INFO] Apache CloudStack Plugin - User Authenticator MD5 . SUCCESS [3.376s]
[INFO] Apache CloudStack Plugin - User Authenticator Plain Text  SUCCESS [3.278s]
[INFO] Apache CloudStack Plugin - User Authenticator SHA256 Salted  SUCCESS [6.036s]
[INFO] Apache CloudStack Plugin - Dns Notifier Example ... SUCCESS [3.226s]
[INFO] Apache CloudStack Plugin - Storage Image S3 ....... SUCCESS [3.581s]
[INFO] Apache CloudStack Plugin - Storage Image Swift provider  SUCCESS [3.310s]
[INFO] Apache CloudStack Plugin - Storage Image default provider  SUCCESS [3.124s]
[INFO] Apache CloudStack Plugin - Storage Image sample provider  SUCCESS [3.460s]
[INFO] Apache CloudStack Plugin - Storage Volume Nexenta Provider  SUCCESS [5.690s]
[INFO] Apache CloudStack Plugin - Storage Volume SolidFire Provider  SUCCESS [6.004s]
[INFO] Apache CloudStack Plugin - Storage Volume default provider  SUCCESS [3.464s]
[INFO] Apache CloudStack Plugin - Storage Volume sample provider  SUCCESS [3.018s]
[INFO] Apache CloudStack Plugin - SNMP Alerts ............ SUCCESS [6.096s]
[INFO] Apache CloudStack Plugin - Syslog Alerts .......... SUCCESS [5.615s]
[INFO] Apache CloudStack Plugin - Network VXLAN .......... SUCCESS [6.913s]
[INFO] Apache CloudStack Framework - Spring Life Cycle ... SUCCESS [3.408s]
[INFO] Apache CloudStack Framework - Spring Module ....... SUCCESS [9.605s]
[INFO] Apache CloudStack Console Proxy - RDP Client ...... SUCCESS [9.567s]
[INFO] Apache CloudStack Console Proxy ................... SUCCESS [0.331s]
[INFO] Apache CloudStack Console Proxy - Server .......... SUCCESS [4.870s]
[INFO] Apache CloudStack System VM ....................... SUCCESS [43.531s]
[INFO] Apache CloudStack Client UI ....................... SUCCESS [11.578s]
[INFO] Apache CloudStack Framework - QuickCloud .......... SUCCESS [1.254s]
[INFO] Apache CloudStack AWS API Bridge .................. FAILURE [8.279s]
[INFO] ------------------------------------------------------------------------
[INFO] BUILD FAILURE
[INFO] ------------------------------------------------------------------------
[INFO] Total time: 11:17.074s
[INFO] Finished at: Fri Jan 24 11:48:54 CET 2014
[INFO] Final Memory: 88M/210M
[INFO] ------------------------------------------------------------------------
[ERROR] Failed to execute goal org.apache.maven.plugins:maven-compiler-plugin:2.5.1:compile
(default-compile) on project cloud-awsapi: Compilation failure: Compilation failure:
[ERROR] error: error reading /jenkins/.m2/repository/org/apache/axis2/mex/1.5.4/mex-1.5.4-impl.jar;
error in opening zip file
[ERROR] error: error reading /jenkins/.m2/repository/org/apache/axis2/axis2-mtompolicy/1.5.4/axis2-mtompolicy-1.5.4.jar;
error in opening zip file
[ERROR] error: error reading /jenkins/.m2/repository/org/apache/ws/commons/axiom/axiom-dom/1.2.10/axiom-dom-1.2.10.jar;
error in opening zip file
[ERROR] error: error reading /jenkins/.m2/repository/org/opensaml/opensaml1/1.1/opensaml1-1.1.jar;
error in opening zip file
[ERROR] error: error reading /jenkins/.m2/repository/commons-lang/commons-lang/2.3/commons-lang-2.3.jar;
error in opening zip file
[ERROR] -> [Help 1]
[ERROR] 
[ERROR] To see the full stack trace of the errors, re-run Maven with the -e switch.
[ERROR] Re-run Maven using the -X switch to enable full debug logging.
[ERROR] 
[ERROR] For more information about the errors and possible solutions, please read the following
articles:
[ERROR] [Help 1] http://cwiki.apache.org/confluence/display/MAVEN/MojoFailureException
[ERROR] 
[ERROR] After correcting the problems, you can resume the build with the command
[ERROR]   mvn <goals> -rf :cloud-awsapi
Build step 'Invoke top-level Maven targets' marked build as failure
Archiving artifacts
Skipping Cobertura coverage report as build was not SUCCESS or better ...

Mime
View raw message