cloudstack-dev mailing list archives

Site index · List index
Message view « Date » · « Thread »
Top « Date » · « Thread »
From jenk...@cloudstack.org
Subject Build failed in Jenkins: build-master #100
Date Wed, 22 Jan 2014 03:03:37 GMT
See <http://jenkins.buildacloud.org/job/build-master/100/changes>

Changes:

[Alena Prokharchyk] Changed "authenticate" method to return both - result of authentication,
and action to perform when authentication failed - to the accountManagerImpl. Only if authenicators
request INCREMENT_INCORRECT_LOGIN_ATTEMPT_COUNT, the incorrect_login_attempts parameter will
be increased

------------------------------------------
[...truncated 3314 lines...]
[INFO] 
[INFO] --- maven-checkstyle-plugin:2.11:check (cloudstack-checkstyle) @ cloud-plugin-user-authenticator-md5
---
[INFO] Starting audit...
Audit done.

[INFO] 
[INFO] --- maven-remote-resources-plugin:1.3:process (default) @ cloud-plugin-user-authenticator-md5
---
[INFO] 
[INFO] --- maven-resources-plugin:2.5:resources (default-resources) @ cloud-plugin-user-authenticator-md5
---
[debug] execute contextualize
[INFO] Using 'UTF-8' encoding to copy filtered resources.
[INFO] Copying 2 resources
[INFO] Copying 3 resources
[INFO] 
[INFO] --- maven-compiler-plugin:2.5.1:compile (default-compile) @ cloud-plugin-user-authenticator-md5
---
[INFO] Compiling 1 source file to <http://jenkins.buildacloud.org/job/build-master/ws/plugins/user-authenticators/md5/target/classes>
[INFO] 
[INFO] --- maven-resources-plugin:2.5:testResources (default-testResources) @ cloud-plugin-user-authenticator-md5
---
[debug] execute contextualize
[INFO] Using 'UTF-8' encoding to copy filtered resources.
[INFO] skip non existing resourceDirectory <http://jenkins.buildacloud.org/job/build-master/ws/plugins/user-authenticators/md5/test/resources>
[INFO] Copying 3 resources
[INFO] 
[INFO] --- maven-compiler-plugin:2.5.1:testCompile (default-testCompile) @ cloud-plugin-user-authenticator-md5
---
[INFO] No sources to compile
[INFO] 
[INFO] --- maven-surefire-plugin:2.12:test (default-test) @ cloud-plugin-user-authenticator-md5
---
[INFO] Surefire report directory: <http://jenkins.buildacloud.org/job/build-master/ws/plugins/user-authenticators/md5/target/surefire-reports>

-------------------------------------------------------
 T E S T S
-------------------------------------------------------

Results :

Tests run: 0, Failures: 0, Errors: 0, Skipped: 0

[INFO]                                                                         
[INFO] ------------------------------------------------------------------------
[INFO] Building Apache CloudStack Plugin - User Authenticator Plain Text 4.4.0-SNAPSHOT
[INFO] ------------------------------------------------------------------------
[INFO] 
[INFO] --- maven-clean-plugin:2.5:clean (default-clean) @ cloud-plugin-user-authenticator-plaintext
---
[INFO] Deleting <http://jenkins.buildacloud.org/job/build-master/ws/plugins/user-authenticators/plain-text/target>
(includes = [**/*], excludes = [])
[INFO] Deleting <http://jenkins.buildacloud.org/job/build-master/ws/plugins/user-authenticators/plain-text>
(includes = [target, dist], excludes = [])
[INFO] 
[INFO] --- maven-checkstyle-plugin:2.11:check (cloudstack-checkstyle) @ cloud-plugin-user-authenticator-plaintext
---
[INFO] Starting audit...
Audit done.

[INFO] 
[INFO] --- maven-remote-resources-plugin:1.3:process (default) @ cloud-plugin-user-authenticator-plaintext
---
[INFO] 
[INFO] --- maven-resources-plugin:2.5:resources (default-resources) @ cloud-plugin-user-authenticator-plaintext
---
[debug] execute contextualize
[INFO] Using 'UTF-8' encoding to copy filtered resources.
[INFO] Copying 2 resources
[INFO] Copying 3 resources
[INFO] 
[INFO] --- maven-compiler-plugin:2.5.1:compile (default-compile) @ cloud-plugin-user-authenticator-plaintext
---
[INFO] Compiling 1 source file to <http://jenkins.buildacloud.org/job/build-master/ws/plugins/user-authenticators/plain-text/target/classes>
[INFO] 
[INFO] --- maven-resources-plugin:2.5:testResources (default-testResources) @ cloud-plugin-user-authenticator-plaintext
---
[debug] execute contextualize
[INFO] Using 'UTF-8' encoding to copy filtered resources.
[INFO] skip non existing resourceDirectory <http://jenkins.buildacloud.org/job/build-master/ws/plugins/user-authenticators/plain-text/test/resources>
[INFO] Copying 3 resources
[INFO] 
[INFO] --- maven-compiler-plugin:2.5.1:testCompile (default-testCompile) @ cloud-plugin-user-authenticator-plaintext
---
[INFO] No sources to compile
[INFO] 
[INFO] --- maven-surefire-plugin:2.12:test (default-test) @ cloud-plugin-user-authenticator-plaintext
---
[INFO] Surefire report directory: <http://jenkins.buildacloud.org/job/build-master/ws/plugins/user-authenticators/plain-text/target/surefire-reports>

-------------------------------------------------------
 T E S T S
-------------------------------------------------------

Results :

Tests run: 0, Failures: 0, Errors: 0, Skipped: 0

[INFO]                                                                         
[INFO] ------------------------------------------------------------------------
[INFO] Building Apache CloudStack Plugin - User Authenticator SHA256 Salted 4.4.0-SNAPSHOT
[INFO] ------------------------------------------------------------------------
[INFO] 
[INFO] --- maven-clean-plugin:2.5:clean (default-clean) @ cloud-plugin-user-authenticator-sha256salted
---
[INFO] Deleting <http://jenkins.buildacloud.org/job/build-master/ws/plugins/user-authenticators/sha256salted/target>
(includes = [**/*], excludes = [])
[INFO] Deleting <http://jenkins.buildacloud.org/job/build-master/ws/plugins/user-authenticators/sha256salted>
(includes = [target, dist], excludes = [])
[INFO] 
[INFO] --- maven-checkstyle-plugin:2.11:check (cloudstack-checkstyle) @ cloud-plugin-user-authenticator-sha256salted
---
[INFO] Starting audit...
Audit done.

[INFO] 
[INFO] --- maven-remote-resources-plugin:1.3:process (default) @ cloud-plugin-user-authenticator-sha256salted
---
[INFO] 
[INFO] --- maven-resources-plugin:2.5:resources (default-resources) @ cloud-plugin-user-authenticator-sha256salted
---
[debug] execute contextualize
[INFO] Using 'UTF-8' encoding to copy filtered resources.
[INFO] Copying 2 resources
[INFO] Copying 3 resources
[INFO] 
[INFO] --- maven-compiler-plugin:2.5.1:compile (default-compile) @ cloud-plugin-user-authenticator-sha256salted
---
[INFO] Compiling 1 source file to <http://jenkins.buildacloud.org/job/build-master/ws/plugins/user-authenticators/sha256salted/target/classes>
[INFO] 
[INFO] --- maven-resources-plugin:2.5:testResources (default-testResources) @ cloud-plugin-user-authenticator-sha256salted
---
[debug] execute contextualize
[INFO] Using 'UTF-8' encoding to copy filtered resources.
[INFO] skip non existing resourceDirectory <http://jenkins.buildacloud.org/job/build-master/ws/plugins/user-authenticators/sha256salted/test/resources>
[INFO] Copying 3 resources
[INFO] 
[INFO] --- maven-compiler-plugin:2.5.1:testCompile (default-testCompile) @ cloud-plugin-user-authenticator-sha256salted
---
[INFO] Compiling 1 source file to <http://jenkins.buildacloud.org/job/build-master/ws/plugins/user-authenticators/sha256salted/target/test-classes>
[INFO] 
[INFO] --- maven-surefire-plugin:2.12:test (default-test) @ cloud-plugin-user-authenticator-sha256salted
---
[INFO] Surefire report directory: <http://jenkins.buildacloud.org/job/build-master/ws/plugins/user-authenticators/sha256salted/target/surefire-reports>

-------------------------------------------------------
 T E S T S
-------------------------------------------------------
Running src.com.cloud.server.auth.test.AuthenticatorTest
log4j:WARN No appenders could be found for logger (com.cloud.server.auth.SHA256SaltedUserAuthenticator).
log4j:WARN Please initialize the log4j system properly.
log4j:WARN See http://logging.apache.org/log4j/1.2/faq.html#noconfig for more info.
Tests run: 2, Failures: 1, Errors: 0, Skipped: 0, Time elapsed: 1.038 sec <<< FAILURE!

Results :

Failed tests:   testAuthentication(src.com.cloud.server.auth.test.AuthenticatorTest): 32 byte
salt authenticated expected:<true> but was:<P[true:null]>

Tests run: 2, Failures: 1, Errors: 0, Skipped: 0

[INFO] ------------------------------------------------------------------------
[INFO] Reactor Summary:
[INFO] 
[INFO] Apache CloudStack Developer Tools - Checkstyle Configuration  SUCCESS [1.445s]
[INFO] Apache CloudStack ................................. SUCCESS [1.418s]
[INFO] Apache CloudStack Maven Conventions Parent ........ SUCCESS [2.810s]
[INFO] Apache CloudStack Framework - Managed Context ..... SUCCESS [6.543s]
[INFO] Apache CloudStack Utils ........................... SUCCESS [15.155s]
[INFO] Apache CloudStack Framework ....................... SUCCESS [2.053s]
[INFO] Apache CloudStack Framework - Event Notification .. SUCCESS [9.974s]
[INFO] Apache CloudStack Framework - Configuration ....... SUCCESS [5.832s]
[INFO] Apache CloudStack API ............................. SUCCESS [19.902s]
[INFO] Apache CloudStack Framework - REST ................ SUCCESS [3.704s]
[INFO] Apache CloudStack Framework - IPC ................. SUCCESS [7.787s]
[INFO] Apache CloudStack Cloud Engine .................... SUCCESS [5.119s]
[INFO] Apache CloudStack Cloud Engine API ................ SUCCESS [6.019s]
[INFO] Apache CloudStack Framework - Security ............ SUCCESS [3.390s]
[INFO] Apache CloudStack Core ............................ SUCCESS [11.338s]
[INFO] Apache CloudStack Agents .......................... SUCCESS [7.121s]
[INFO] Apache CloudStack Framework - Clustering .......... SUCCESS [4.633s]
[INFO] Apache CloudStack Framework - Jobs ................ SUCCESS [5.130s]
[INFO] Apache CloudStack Cloud Engine Schema Component ... SUCCESS [17.037s]
[INFO] Apache CloudStack Framework - Event Notification .. SUCCESS [2.467s]
[INFO] Apache CloudStack Cloud Engine Internal Components API  SUCCESS [3.966s]
[INFO] Apache CloudStack Server .......................... SUCCESS [58.612s]
[INFO] Apache CloudStack Usage Server .................... SUCCESS [10.083s]
[INFO] Apache XenSource XAPI ............................. SUCCESS [7.557s]
[INFO] Apache CloudStack Cloud Engine Orchestration Component  SUCCESS [13.133s]
[INFO] Apache CloudStack Cloud Services .................. SUCCESS [1.983s]
[INFO] Apache CloudStack Secondary Storage Service ....... SUCCESS [6.397s]
[INFO] Apache CloudStack Engine Storage Component ........ SUCCESS [8.720s]
[INFO] Apache CloudStack Engine Storage Volume Component . SUCCESS [5.737s]
[INFO] Apache CloudStack Engine Storage Image Component .. SUCCESS [4.929s]
[INFO] Apache CloudStack Engine Storage Data Motion Component  SUCCESS [3.536s]
[INFO] Apache CloudStack Engine Storage Cache Component .. SUCCESS [3.223s]
[INFO] Apache CloudStack Engine Storage Snapshot Component  SUCCESS [10.654s]
[INFO] Apache CloudStack Cloud Engine API ................ SUCCESS [2.635s]
[INFO] Apache CloudStack Cloud Engine Service ............ SUCCESS [1.334s]
[INFO] Apache CloudStack Plugin POM ...................... SUCCESS [3.806s]
[INFO] Apache CloudStack Plugin - API Rate Limit ......... SUCCESS [8.967s]
[INFO] Apache CloudStack Plugin - API Discovery .......... SUCCESS [6.057s]
[INFO] Apache CloudStack Plugin - ACL Static Role Based .. SUCCESS [2.874s]
[INFO] Apache CloudStack Plugin - Host Anti-Affinity Processor  SUCCESS [3.060s]
[INFO] Apache CloudStack Plugin - Explicit Dedication Processor  SUCCESS [3.549s]
[INFO] Apache CloudStack Plugin - User Concentrated Pod Deployment Planner  SUCCESS [3.171s]
[INFO] Apache CloudStack Plugin - User Dispersing Deployment Planner  SUCCESS [3.018s]
[INFO] Apache CloudStack Plugin - Implicit Dedication Planner  SUCCESS [10.348s]
[INFO] Apache CloudStack Plugin - Skip Heurestics Planner  SUCCESS [2.885s]
[INFO] Apache CloudStack Plugin - Host Allocator Random .. SUCCESS [3.123s]
[INFO] Apache CloudStack Plugin - Dedicated Resources .... SUCCESS [9.526s]
[INFO] Apache CloudStack Plugin - Hypervisor OracleVM .... SUCCESS [4.344s]
[INFO] Apache CloudStack Plugin - Open vSwitch ........... SUCCESS [4.063s]
[INFO] Apache CloudStack Plugin - Hypervisor Xen ......... SUCCESS [13.373s]
[INFO] Apache CloudStack Plugin - Hypervisor KVM ......... SUCCESS [11.418s]
[INFO] Apache CloudStack Plugin - RabbitMQ Event Bus ..... SUCCESS [3.144s]
[INFO] Apache CloudStack Plugin - In Memory Event Bus .... SUCCESS [2.810s]
[INFO] Apache CloudStack Plugin - Hypervisor Baremetal ... SUCCESS [5.882s]
[INFO] Apache CloudStack Plugin - Hypervisor UCS ......... SUCCESS [4.101s]
[INFO] Apache CloudStack Plugin - Hypervisor Hyper-V ..... SUCCESS [7.189s]
[INFO] Apache CloudStack Plugin - Network Elastic Load Balancer  SUCCESS [4.162s]
[INFO] Apache CloudStack Plugin - Network Internal Load Balancer  SUCCESS [12.853s]
[INFO] Apache CloudStack Plugin - Network Juniper Contrail  SUCCESS [14.778s]
[INFO] Apache CloudStack Plugin - Palo Alto .............. SUCCESS [9.504s]
[INFO] Apache CloudStack Plugin - Network Nicira NVP ..... SUCCESS [11.172s]
[INFO] Apache CloudStack Plugin - BigSwitch Virtual Network Segment  SUCCESS [7.740s]
[INFO] Apache CloudStack Plugin - Midokura Midonet ....... SUCCESS [7.803s]
[INFO] Apache Cloudstack Plugin - Stratosphere SSP ....... SUCCESS [7.854s]
[INFO] Apache CloudStack Plugin - Network Opendaylight ... SUCCESS [7.542s]
[INFO] Apache CloudStack Plugin - Storage Allocator Random  SUCCESS [3.725s]
[INFO] Apache CloudStack Plugin - User Authenticator LDAP  SUCCESS [4.251s]
[INFO] Apache CloudStack Plugin - User Authenticator MD5 . SUCCESS [3.833s]
[INFO] Apache CloudStack Plugin - User Authenticator Plain Text  SUCCESS [4.096s]
[INFO] Apache CloudStack Plugin - User Authenticator SHA256 Salted  FAILURE [6.989s]
[INFO] Apache CloudStack Plugin - Dns Notifier Example ... SKIPPED
[INFO] Apache CloudStack Plugin - Storage Image S3 ....... SKIPPED
[INFO] Apache CloudStack Plugin - Storage Image Swift provider  SKIPPED
[INFO] Apache CloudStack Plugin - Storage Image default provider  SKIPPED
[INFO] Apache CloudStack Plugin - Storage Image sample provider  SKIPPED
[INFO] Apache CloudStack Plugin - Storage Volume Nexenta Provider  SKIPPED
[INFO] Apache CloudStack Plugin - Storage Volume SolidFire Provider  SKIPPED
[INFO] Apache CloudStack Plugin - Storage Volume default provider  SKIPPED
[INFO] Apache CloudStack Plugin - Storage Volume sample provider  SKIPPED
[INFO] Apache CloudStack Plugin - SNMP Alerts ............ SKIPPED
[INFO] Apache CloudStack Plugin - Syslog Alerts .......... SKIPPED
[INFO] Apache CloudStack Plugin - Network VXLAN .......... SKIPPED
[INFO] Apache CloudStack Framework - Spring Life Cycle ... SKIPPED
[INFO] cloud-framework-spring-module ..................... SKIPPED
[INFO] Apache CloudStack Test ............................ SKIPPED
[INFO] Apache CloudStack Console Proxy ................... SKIPPED
[INFO] Apache CloudStack Console Proxy - Server .......... SKIPPED
[INFO] Apache CloudStack System VM ....................... SKIPPED
[INFO] Apache CloudStack Client UI ....................... SKIPPED
[INFO] Apache CloudStack Console Proxy - RDP Client ...... SKIPPED
[INFO] Apache CloudStack Framework - QuickCloud .......... SKIPPED
[INFO] ------------------------------------------------------------------------
[INFO] BUILD FAILURE
[INFO] ------------------------------------------------------------------------
[INFO] Total time: 8:28.554s
[INFO] Finished at: Wed Jan 22 04:03:32 CET 2014
[INFO] Final Memory: 60M/165M
[INFO] ------------------------------------------------------------------------
[ERROR] Failed to execute goal org.apache.maven.plugins:maven-surefire-plugin:2.12:test (default-test)
on project cloud-plugin-user-authenticator-sha256salted: There are test failures.
[ERROR] 
[ERROR] Please refer to <http://jenkins.buildacloud.org/job/build-master/ws/plugins/user-authenticators/sha256salted/target/surefire-reports>
for the individual test results.
[ERROR] -> [Help 1]
[ERROR] 
[ERROR] To see the full stack trace of the errors, re-run Maven with the -e switch.
[ERROR] Re-run Maven using the -X switch to enable full debug logging.
[ERROR] 
[ERROR] For more information about the errors and possible solutions, please read the following
articles:
[ERROR] [Help 1] http://cwiki.apache.org/confluence/display/MAVEN/MojoFailureException
[ERROR] 
[ERROR] After correcting the problems, you can resume the build with the command
[ERROR]   mvn <goals> -rf :cloud-plugin-user-authenticator-sha256salted
Build step 'Invoke top-level Maven targets' marked build as failure

Mime
View raw message