cloudstack-dev mailing list archives

Site index · List index
Message view « Date » · « Thread »
Top « Date » · « Thread »
From Dumindu Buddhika <dumindukarunathil...@gmail.com>
Subject Re: Error while building
Date Tue, 31 Dec 2013 14:25:23 GMT
Thanks for the feedback.
Here is the report containing the test error(report file you pointed out).
it says some file is missing.
Please let me know the cause for the error if you can help. :)

Thank you

-------------------------------------------------------------------------------
Test set: org.apache.cloudstack.network.lb.CertServiceTest
-------------------------------------------------------------------------------
Tests run: 15, Failures: 0, Errors: 12, Skipped: 0, Time elapsed: 1.6 sec
<<< FAILURE!
runUploadSslCertWithCAChain(org.apache.cloudstack.network.lb.CertServiceTest)
 Time elapsed: 0.324 sec  <<< ERROR!
java.io.FileNotFoundException: File
'/media/TV%26Movie/aca/cloudstack/server/target/test-classes/certs/rsa_ca_signed.crt'
does not exist
at org.apache.commons.io.FileUtils.openInputStream(FileUtils.java:137)
at org.apache.commons.io.FileUtils.readFileToString(FileUtils.java:1102)
at org.apache.commons.io.FileUtils.readFileToString(FileUtils.java:1120)
at
org.apache.cloudstack.network.lb.CertServiceTest.runUploadSslCertWithCAChain(CertServiceTest.java:104)
at sun.reflect.NativeMethodAccessorImpl.invoke0(Native Method)
at
sun.reflect.NativeMethodAccessorImpl.invoke(NativeMethodAccessorImpl.java:57)
at
sun.reflect.DelegatingMethodAccessorImpl.invoke(DelegatingMethodAccessorImpl.java:43)
at java.lang.reflect.Method.invoke(Method.java:616)
at
org.junit.runners.model.FrameworkMethod$1.runReflectiveCall(FrameworkMethod.java:45)
at
org.junit.internal.runners.model.ReflectiveCallable.run(ReflectiveCallable.java:15)
at
org.junit.runners.model.FrameworkMethod.invokeExplosively(FrameworkMethod.java:42)
at
org.junit.internal.runners.statements.InvokeMethod.evaluate(InvokeMethod.java:20)
at
org.junit.internal.runners.statements.RunBefores.evaluate(RunBefores.java:28)
at
org.junit.internal.runners.statements.RunAfters.evaluate(RunAfters.java:30)
at org.junit.runners.ParentRunner.runLeaf(ParentRunner.java:263)
at
org.junit.runners.BlockJUnit4ClassRunner.runChild(BlockJUnit4ClassRunner.java:68)
at
org.junit.runners.BlockJUnit4ClassRunner.runChild(BlockJUnit4ClassRunner.java:47)
at org.junit.runners.ParentRunner$3.run(ParentRunner.java:231)
at org.junit.runners.ParentRunner$1.schedule(ParentRunner.java:60)
at org.junit.runners.ParentRunner.runChildren(ParentRunner.java:229)
at org.junit.runners.ParentRunner.access$000(ParentRunner.java:50)
at org.junit.runners.ParentRunner$2.evaluate(ParentRunner.java:222)
at org.junit.runners.ParentRunner.run(ParentRunner.java:300)
at
org.apache.maven.surefire.junit4.JUnit4Provider.execute(JUnit4Provider.java:236)
at
org.apache.maven.surefire.junit4.JUnit4Provider.executeTestSet(JUnit4Provider.java:134)
at
org.apache.maven.surefire.junit4.JUnit4Provider.invoke(JUnit4Provider.java:113)
at sun.reflect.NativeMethodAccessorImpl.invoke0(Native Method)
at
sun.reflect.NativeMethodAccessorImpl.invoke(NativeMethodAccessorImpl.java:57)
at
sun.reflect.DelegatingMethodAccessorImpl.invoke(DelegatingMethodAccessorImpl.java:43)
at java.lang.reflect.Method.invoke(Method.java:616)
at
org.apache.maven.surefire.util.ReflectionUtils.invokeMethodWithArray(ReflectionUtils.java:189)
at
org.apache.maven.surefire.booter.ProviderFactory$ProviderProxy.invoke(ProviderFactory.java:165)
at
org.apache.maven.surefire.booter.ProviderFactory.invokeProvider(ProviderFactory.java:85)
at
org.apache.maven.surefire.booter.ForkedBooter.runSuitesInProcess(ForkedBooter.java:103)
at org.apache.maven.surefire.booter.ForkedBooter.main(ForkedBooter.java:74)
runUploadSslCertSelfSignedWithPassword(org.apache.cloudstack.network.lb.CertServiceTest)
 Time elapsed: 0 sec  <<< ERROR!
java.io.FileNotFoundException: File
'/media/TV%26Movie/aca/cloudstack/server/target/test-classes/certs/rsa_self_signed_with_pwd.crt'
does not exist
at org.apache.commons.io.FileUtils.openInputStream(FileUtils.java:137)
at org.apache.commons.io.FileUtils.readFileToString(FileUtils.java:1102)
at org.apache.commons.io.FileUtils.readFileToString(FileUtils.java:1120)
at
org.apache.cloudstack.network.lb.CertServiceTest.runUploadSslCertSelfSignedWithPassword(CertServiceTest.java:156)
at sun.reflect.NativeMethodAccessorImpl.invoke0(Native Method)
at
sun.reflect.NativeMethodAccessorImpl.invoke(NativeMethodAccessorImpl.java:57)
at
sun.reflect.DelegatingMethodAccessorImpl.invoke(DelegatingMethodAccessorImpl.java:43)
at java.lang.reflect.Method.invoke(Method.java:616)
at
org.junit.runners.model.FrameworkMethod$1.runReflectiveCall(FrameworkMethod.java:45)
at
org.junit.internal.runners.model.ReflectiveCallable.run(ReflectiveCallable.java:15)
at
org.junit.runners.model.FrameworkMethod.invokeExplosively(FrameworkMethod.java:42)
at
org.junit.internal.runners.statements.InvokeMethod.evaluate(InvokeMethod.java:20)
at
org.junit.internal.runners.statements.RunBefores.evaluate(RunBefores.java:28)
at
org.junit.internal.runners.statements.RunAfters.evaluate(RunAfters.java:30)
at org.junit.runners.ParentRunner.runLeaf(ParentRunner.java:263)
at
org.junit.runners.BlockJUnit4ClassRunner.runChild(BlockJUnit4ClassRunner.java:68)
at
org.junit.runners.BlockJUnit4ClassRunner.runChild(BlockJUnit4ClassRunner.java:47)
at org.junit.runners.ParentRunner$3.run(ParentRunner.java:231)
at org.junit.runners.ParentRunner$1.schedule(ParentRunner.java:60)
at org.junit.runners.ParentRunner.runChildren(ParentRunner.java:229)
at org.junit.runners.ParentRunner.access$000(ParentRunner.java:50)
at org.junit.runners.ParentRunner$2.evaluate(ParentRunner.java:222)
at org.junit.runners.ParentRunner.run(ParentRunner.java:300)
at
org.apache.maven.surefire.junit4.JUnit4Provider.execute(JUnit4Provider.java:236)
at
org.apache.maven.surefire.junit4.JUnit4Provider.executeTestSet(JUnit4Provider.java:134)
at
org.apache.maven.surefire.junit4.JUnit4Provider.invoke(JUnit4Provider.java:113)
at sun.reflect.NativeMethodAccessorImpl.invoke0(Native Method)
at
sun.reflect.NativeMethodAccessorImpl.invoke(NativeMethodAccessorImpl.java:57)
at
sun.reflect.DelegatingMethodAccessorImpl.invoke(DelegatingMethodAccessorImpl.java:43)
at java.lang.reflect.Method.invoke(Method.java:616)
at
org.apache.maven.surefire.util.ReflectionUtils.invokeMethodWithArray(ReflectionUtils.java:189)
at
org.apache.maven.surefire.booter.ProviderFactory$ProviderProxy.invoke(ProviderFactory.java:165)
at
org.apache.maven.surefire.booter.ProviderFactory.invokeProvider(ProviderFactory.java:85)
at
org.apache.maven.surefire.booter.ForkedBooter.runSuitesInProcess(ForkedBooter.java:103)
at org.apache.maven.surefire.booter.ForkedBooter.main(ForkedBooter.java:74)
runUploadSslCertSelfSignedNoPassword(org.apache.cloudstack.network.lb.CertServiceTest)
 Time elapsed: 0 sec  <<< ERROR!
java.io.FileNotFoundException: File
'/media/TV%26Movie/aca/cloudstack/server/target/test-classes/certs/rsa_self_signed.crt'
does not exist
at org.apache.commons.io.FileUtils.openInputStream(FileUtils.java:137)
at org.apache.commons.io.FileUtils.readFileToString(FileUtils.java:1102)
at org.apache.commons.io.FileUtils.readFileToString(FileUtils.java:1120)
at
org.apache.cloudstack.network.lb.CertServiceTest.runUploadSslCertSelfSignedNoPassword(CertServiceTest.java:202)
at sun.reflect.NativeMethodAccessorImpl.invoke0(Native Method)
at
sun.reflect.NativeMethodAccessorImpl.invoke(NativeMethodAccessorImpl.java:57)
at
sun.reflect.DelegatingMethodAccessorImpl.invoke(DelegatingMethodAccessorImpl.java:43)
at java.lang.reflect.Method.invoke(Method.java:616)
at
org.junit.runners.model.FrameworkMethod$1.runReflectiveCall(FrameworkMethod.java:45)
at
org.junit.internal.runners.model.ReflectiveCallable.run(ReflectiveCallable.java:15)
at
org.junit.runners.model.FrameworkMethod.invokeExplosively(FrameworkMethod.java:42)
at
org.junit.internal.runners.statements.InvokeMethod.evaluate(InvokeMethod.java:20)
at
org.junit.internal.runners.statements.RunBefores.evaluate(RunBefores.java:28)
at
org.junit.internal.runners.statements.RunAfters.evaluate(RunAfters.java:30)
at org.junit.runners.ParentRunner.runLeaf(ParentRunner.java:263)
at
org.junit.runners.BlockJUnit4ClassRunner.runChild(BlockJUnit4ClassRunner.java:68)
at
org.junit.runners.BlockJUnit4ClassRunner.runChild(BlockJUnit4ClassRunner.java:47)
at org.junit.runners.ParentRunner$3.run(ParentRunner.java:231)
at org.junit.runners.ParentRunner$1.schedule(ParentRunner.java:60)
at org.junit.runners.ParentRunner.runChildren(ParentRunner.java:229)
at org.junit.runners.ParentRunner.access$000(ParentRunner.java:50)
at org.junit.runners.ParentRunner$2.evaluate(ParentRunner.java:222)
at org.junit.runners.ParentRunner.run(ParentRunner.java:300)
at
org.apache.maven.surefire.junit4.JUnit4Provider.execute(JUnit4Provider.java:236)
at
org.apache.maven.surefire.junit4.JUnit4Provider.executeTestSet(JUnit4Provider.java:134)
at
org.apache.maven.surefire.junit4.JUnit4Provider.invoke(JUnit4Provider.java:113)
at sun.reflect.NativeMethodAccessorImpl.invoke0(Native Method)
at
sun.reflect.NativeMethodAccessorImpl.invoke(NativeMethodAccessorImpl.java:57)
at
sun.reflect.DelegatingMethodAccessorImpl.invoke(DelegatingMethodAccessorImpl.java:43)
at java.lang.reflect.Method.invoke(Method.java:616)
at
org.apache.maven.surefire.util.ReflectionUtils.invokeMethodWithArray(ReflectionUtils.java:189)
at
org.apache.maven.surefire.booter.ProviderFactory$ProviderProxy.invoke(ProviderFactory.java:165)
at
org.apache.maven.surefire.booter.ProviderFactory.invokeProvider(ProviderFactory.java:85)
at
org.apache.maven.surefire.booter.ForkedBooter.runSuitesInProcess(ForkedBooter.java:103)
at org.apache.maven.surefire.booter.ForkedBooter.main(ForkedBooter.java:74)
runUploadSslCertBadChain(org.apache.cloudstack.network.lb.CertServiceTest)
 Time elapsed: 0 sec  <<< ERROR!
java.io.FileNotFoundException: File
'/media/TV%26Movie/aca/cloudstack/server/target/test-classes/certs/rsa_ca_signed.crt'
does not exist
at org.apache.commons.io.FileUtils.openInputStream(FileUtils.java:137)
at org.apache.commons.io.FileUtils.readFileToString(FileUtils.java:1102)
at org.apache.commons.io.FileUtils.readFileToString(FileUtils.java:1120)
at
org.apache.cloudstack.network.lb.CertServiceTest.runUploadSslCertBadChain(CertServiceTest.java:242)
at sun.reflect.NativeMethodAccessorImpl.invoke0(Native Method)
at
sun.reflect.NativeMethodAccessorImpl.invoke(NativeMethodAccessorImpl.java:57)
at
sun.reflect.DelegatingMethodAccessorImpl.invoke(DelegatingMethodAccessorImpl.java:43)
at java.lang.reflect.Method.invoke(Method.java:616)
at
org.junit.runners.model.FrameworkMethod$1.runReflectiveCall(FrameworkMethod.java:45)
at
org.junit.internal.runners.model.ReflectiveCallable.run(ReflectiveCallable.java:15)
at
org.junit.runners.model.FrameworkMethod.invokeExplosively(FrameworkMethod.java:42)
at
org.junit.internal.runners.statements.InvokeMethod.evaluate(InvokeMethod.java:20)
at
org.junit.internal.runners.statements.RunBefores.evaluate(RunBefores.java:28)
at
org.junit.internal.runners.statements.RunAfters.evaluate(RunAfters.java:30)
at org.junit.runners.ParentRunner.runLeaf(ParentRunner.java:263)
at
org.junit.runners.BlockJUnit4ClassRunner.runChild(BlockJUnit4ClassRunner.java:68)
at
org.junit.runners.BlockJUnit4ClassRunner.runChild(BlockJUnit4ClassRunner.java:47)
at org.junit.runners.ParentRunner$3.run(ParentRunner.java:231)
at org.junit.runners.ParentRunner$1.schedule(ParentRunner.java:60)
at org.junit.runners.ParentRunner.runChildren(ParentRunner.java:229)
at org.junit.runners.ParentRunner.access$000(ParentRunner.java:50)
at org.junit.runners.ParentRunner$2.evaluate(ParentRunner.java:222)
at org.junit.runners.ParentRunner.run(ParentRunner.java:300)
at
org.apache.maven.surefire.junit4.JUnit4Provider.execute(JUnit4Provider.java:236)
at
org.apache.maven.surefire.junit4.JUnit4Provider.executeTestSet(JUnit4Provider.java:134)
at
org.apache.maven.surefire.junit4.JUnit4Provider.invoke(JUnit4Provider.java:113)
at sun.reflect.NativeMethodAccessorImpl.invoke0(Native Method)
at
sun.reflect.NativeMethodAccessorImpl.invoke(NativeMethodAccessorImpl.java:57)
at
sun.reflect.DelegatingMethodAccessorImpl.invoke(DelegatingMethodAccessorImpl.java:43)
at java.lang.reflect.Method.invoke(Method.java:616)
at
org.apache.maven.surefire.util.ReflectionUtils.invokeMethodWithArray(ReflectionUtils.java:189)
at
org.apache.maven.surefire.booter.ProviderFactory$ProviderProxy.invoke(ProviderFactory.java:165)
at
org.apache.maven.surefire.booter.ProviderFactory.invokeProvider(ProviderFactory.java:85)
at
org.apache.maven.surefire.booter.ForkedBooter.runSuitesInProcess(ForkedBooter.java:103)
at org.apache.maven.surefire.booter.ForkedBooter.main(ForkedBooter.java:74)
runUploadSslCertNoRootCert(org.apache.cloudstack.network.lb.CertServiceTest)
 Time elapsed: 0 sec  <<< ERROR!
java.io.FileNotFoundException: File
'/media/TV%26Movie/aca/cloudstack/server/target/test-classes/certs/rsa_ca_signed.crt'
does not exist
at org.apache.commons.io.FileUtils.openInputStream(FileUtils.java:137)
at org.apache.commons.io.FileUtils.readFileToString(FileUtils.java:1102)
at org.apache.commons.io.FileUtils.readFileToString(FileUtils.java:1120)
at
org.apache.cloudstack.network.lb.CertServiceTest.runUploadSslCertNoRootCert(CertServiceTest.java:294)
at sun.reflect.NativeMethodAccessorImpl.invoke0(Native Method)
at
sun.reflect.NativeMethodAccessorImpl.invoke(NativeMethodAccessorImpl.java:57)
at
sun.reflect.DelegatingMethodAccessorImpl.invoke(DelegatingMethodAccessorImpl.java:43)
at java.lang.reflect.Method.invoke(Method.java:616)
at
org.junit.runners.model.FrameworkMethod$1.runReflectiveCall(FrameworkMethod.java:45)
at
org.junit.internal.runners.model.ReflectiveCallable.run(ReflectiveCallable.java:15)
at
org.junit.runners.model.FrameworkMethod.invokeExplosively(FrameworkMethod.java:42)
at
org.junit.internal.runners.statements.InvokeMethod.evaluate(InvokeMethod.java:20)
at
org.junit.internal.runners.statements.RunBefores.evaluate(RunBefores.java:28)
at
org.junit.internal.runners.statements.RunAfters.evaluate(RunAfters.java:30)
at org.junit.runners.ParentRunner.runLeaf(ParentRunner.java:263)
at
org.junit.runners.BlockJUnit4ClassRunner.runChild(BlockJUnit4ClassRunner.java:68)
at
org.junit.runners.BlockJUnit4ClassRunner.runChild(BlockJUnit4ClassRunner.java:47)
at org.junit.runners.ParentRunner$3.run(ParentRunner.java:231)
at org.junit.runners.ParentRunner$1.schedule(ParentRunner.java:60)
at org.junit.runners.ParentRunner.runChildren(ParentRunner.java:229)
at org.junit.runners.ParentRunner.access$000(ParentRunner.java:50)
at org.junit.runners.ParentRunner$2.evaluate(ParentRunner.java:222)
at org.junit.runners.ParentRunner.run(ParentRunner.java:300)
at
org.apache.maven.surefire.junit4.JUnit4Provider.execute(JUnit4Provider.java:236)
at
org.apache.maven.surefire.junit4.JUnit4Provider.executeTestSet(JUnit4Provider.java:134)
at
org.apache.maven.surefire.junit4.JUnit4Provider.invoke(JUnit4Provider.java:113)
at sun.reflect.NativeMethodAccessorImpl.invoke0(Native Method)
at
sun.reflect.NativeMethodAccessorImpl.invoke(NativeMethodAccessorImpl.java:57)
at
sun.reflect.DelegatingMethodAccessorImpl.invoke(DelegatingMethodAccessorImpl.java:43)
at java.lang.reflect.Method.invoke(Method.java:616)
at
org.apache.maven.surefire.util.ReflectionUtils.invokeMethodWithArray(ReflectionUtils.java:189)
at
org.apache.maven.surefire.booter.ProviderFactory$ProviderProxy.invoke(ProviderFactory.java:165)
at
org.apache.maven.surefire.booter.ProviderFactory.invokeProvider(ProviderFactory.java:85)
at
org.apache.maven.surefire.booter.ForkedBooter.runSuitesInProcess(ForkedBooter.java:103)
at org.apache.maven.surefire.booter.ForkedBooter.main(ForkedBooter.java:74)
runUploadSslCertNoChain(org.apache.cloudstack.network.lb.CertServiceTest)
 Time elapsed: 0 sec  <<< ERROR!
java.io.FileNotFoundException: File
'/media/TV%26Movie/aca/cloudstack/server/target/test-classes/certs/rsa_ca_signed.crt'
does not exist
at org.apache.commons.io.FileUtils.openInputStream(FileUtils.java:137)
at org.apache.commons.io.FileUtils.readFileToString(FileUtils.java:1102)
at org.apache.commons.io.FileUtils.readFileToString(FileUtils.java:1120)
at
org.apache.cloudstack.network.lb.CertServiceTest.runUploadSslCertNoChain(CertServiceTest.java:346)
at sun.reflect.NativeMethodAccessorImpl.invoke0(Native Method)
at
sun.reflect.NativeMethodAccessorImpl.invoke(NativeMethodAccessorImpl.java:57)
at
sun.reflect.DelegatingMethodAccessorImpl.invoke(DelegatingMethodAccessorImpl.java:43)
at java.lang.reflect.Method.invoke(Method.java:616)
at
org.junit.runners.model.FrameworkMethod$1.runReflectiveCall(FrameworkMethod.java:45)
at
org.junit.internal.runners.model.ReflectiveCallable.run(ReflectiveCallable.java:15)
at
org.junit.runners.model.FrameworkMethod.invokeExplosively(FrameworkMethod.java:42)
at
org.junit.internal.runners.statements.InvokeMethod.evaluate(InvokeMethod.java:20)
at
org.junit.internal.runners.statements.RunBefores.evaluate(RunBefores.java:28)
at
org.junit.internal.runners.statements.RunAfters.evaluate(RunAfters.java:30)
at org.junit.runners.ParentRunner.runLeaf(ParentRunner.java:263)
at
org.junit.runners.BlockJUnit4ClassRunner.runChild(BlockJUnit4ClassRunner.java:68)
at
org.junit.runners.BlockJUnit4ClassRunner.runChild(BlockJUnit4ClassRunner.java:47)
at org.junit.runners.ParentRunner$3.run(ParentRunner.java:231)
at org.junit.runners.ParentRunner$1.schedule(ParentRunner.java:60)
at org.junit.runners.ParentRunner.runChildren(ParentRunner.java:229)
at org.junit.runners.ParentRunner.access$000(ParentRunner.java:50)
at org.junit.runners.ParentRunner$2.evaluate(ParentRunner.java:222)
at org.junit.runners.ParentRunner.run(ParentRunner.java:300)
at
org.apache.maven.surefire.junit4.JUnit4Provider.execute(JUnit4Provider.java:236)
at
org.apache.maven.surefire.junit4.JUnit4Provider.executeTestSet(JUnit4Provider.java:134)
at
org.apache.maven.surefire.junit4.JUnit4Provider.invoke(JUnit4Provider.java:113)
at sun.reflect.NativeMethodAccessorImpl.invoke0(Native Method)
at
sun.reflect.NativeMethodAccessorImpl.invoke(NativeMethodAccessorImpl.java:57)
at
sun.reflect.DelegatingMethodAccessorImpl.invoke(DelegatingMethodAccessorImpl.java:43)
at java.lang.reflect.Method.invoke(Method.java:616)
at
org.apache.maven.surefire.util.ReflectionUtils.invokeMethodWithArray(ReflectionUtils.java:189)
at
org.apache.maven.surefire.booter.ProviderFactory$ProviderProxy.invoke(ProviderFactory.java:165)
at
org.apache.maven.surefire.booter.ProviderFactory.invokeProvider(ProviderFactory.java:85)
at
org.apache.maven.surefire.booter.ForkedBooter.runSuitesInProcess(ForkedBooter.java:103)
at org.apache.maven.surefire.booter.ForkedBooter.main(ForkedBooter.java:74)
runUploadSslCertBadPassword(org.apache.cloudstack.network.lb.CertServiceTest)
 Time elapsed: 0 sec  <<< ERROR!
java.io.FileNotFoundException: File
'/media/TV%26Movie/aca/cloudstack/server/target/test-classes/certs/rsa_self_signed_with_pwd.crt'
does not exist
at org.apache.commons.io.FileUtils.openInputStream(FileUtils.java:137)
at org.apache.commons.io.FileUtils.readFileToString(FileUtils.java:1102)
at org.apache.commons.io.FileUtils.readFileToString(FileUtils.java:1120)
at
org.apache.cloudstack.network.lb.CertServiceTest.runUploadSslCertBadPassword(CertServiceTest.java:391)
at sun.reflect.NativeMethodAccessorImpl.invoke0(Native Method)
at
sun.reflect.NativeMethodAccessorImpl.invoke(NativeMethodAccessorImpl.java:57)
at
sun.reflect.DelegatingMethodAccessorImpl.invoke(DelegatingMethodAccessorImpl.java:43)
at java.lang.reflect.Method.invoke(Method.java:616)
at
org.junit.runners.model.FrameworkMethod$1.runReflectiveCall(FrameworkMethod.java:45)
at
org.junit.internal.runners.model.ReflectiveCallable.run(ReflectiveCallable.java:15)
at
org.junit.runners.model.FrameworkMethod.invokeExplosively(FrameworkMethod.java:42)
at
org.junit.internal.runners.statements.InvokeMethod.evaluate(InvokeMethod.java:20)
at
org.junit.internal.runners.statements.RunBefores.evaluate(RunBefores.java:28)
at
org.junit.internal.runners.statements.RunAfters.evaluate(RunAfters.java:30)
at org.junit.runners.ParentRunner.runLeaf(ParentRunner.java:263)
at
org.junit.runners.BlockJUnit4ClassRunner.runChild(BlockJUnit4ClassRunner.java:68)
at
org.junit.runners.BlockJUnit4ClassRunner.runChild(BlockJUnit4ClassRunner.java:47)
at org.junit.runners.ParentRunner$3.run(ParentRunner.java:231)
at org.junit.runners.ParentRunner$1.schedule(ParentRunner.java:60)
at org.junit.runners.ParentRunner.runChildren(ParentRunner.java:229)
at org.junit.runners.ParentRunner.access$000(ParentRunner.java:50)
at org.junit.runners.ParentRunner$2.evaluate(ParentRunner.java:222)
at org.junit.runners.ParentRunner.run(ParentRunner.java:300)
at
org.apache.maven.surefire.junit4.JUnit4Provider.execute(JUnit4Provider.java:236)
at
org.apache.maven.surefire.junit4.JUnit4Provider.executeTestSet(JUnit4Provider.java:134)
at
org.apache.maven.surefire.junit4.JUnit4Provider.invoke(JUnit4Provider.java:113)
at sun.reflect.NativeMethodAccessorImpl.invoke0(Native Method)
at
sun.reflect.NativeMethodAccessorImpl.invoke(NativeMethodAccessorImpl.java:57)
at
sun.reflect.DelegatingMethodAccessorImpl.invoke(DelegatingMethodAccessorImpl.java:43)
at java.lang.reflect.Method.invoke(Method.java:616)
at
org.apache.maven.surefire.util.ReflectionUtils.invokeMethodWithArray(ReflectionUtils.java:189)
at
org.apache.maven.surefire.booter.ProviderFactory$ProviderProxy.invoke(ProviderFactory.java:165)
at
org.apache.maven.surefire.booter.ProviderFactory.invokeProvider(ProviderFactory.java:85)
at
org.apache.maven.surefire.booter.ForkedBooter.runSuitesInProcess(ForkedBooter.java:103)
at org.apache.maven.surefire.booter.ForkedBooter.main(ForkedBooter.java:74)
runUploadSslCertBadkeyPair(org.apache.cloudstack.network.lb.CertServiceTest)
 Time elapsed: 0 sec  <<< ERROR!
java.io.FileNotFoundException: File
'/media/TV%26Movie/aca/cloudstack/server/target/test-classes/certs/rsa_self_signed.crt'
does not exist
at org.apache.commons.io.FileUtils.openInputStream(FileUtils.java:137)
at org.apache.commons.io.FileUtils.readFileToString(FileUtils.java:1102)
at org.apache.commons.io.FileUtils.readFileToString(FileUtils.java:1120)
at
org.apache.cloudstack.network.lb.CertServiceTest.runUploadSslCertBadkeyPair(CertServiceTest.java:435)
at sun.reflect.NativeMethodAccessorImpl.invoke0(Native Method)
at
sun.reflect.NativeMethodAccessorImpl.invoke(NativeMethodAccessorImpl.java:57)
at
sun.reflect.DelegatingMethodAccessorImpl.invoke(DelegatingMethodAccessorImpl.java:43)
at java.lang.reflect.Method.invoke(Method.java:616)
at
org.junit.runners.model.FrameworkMethod$1.runReflectiveCall(FrameworkMethod.java:45)
at
org.junit.internal.runners.model.ReflectiveCallable.run(ReflectiveCallable.java:15)
at
org.junit.runners.model.FrameworkMethod.invokeExplosively(FrameworkMethod.java:42)
at
org.junit.internal.runners.statements.InvokeMethod.evaluate(InvokeMethod.java:20)
at
org.junit.internal.runners.statements.RunBefores.evaluate(RunBefores.java:28)
at
org.junit.internal.runners.statements.RunAfters.evaluate(RunAfters.java:30)
at org.junit.runners.ParentRunner.runLeaf(ParentRunner.java:263)
at
org.junit.runners.BlockJUnit4ClassRunner.runChild(BlockJUnit4ClassRunner.java:68)
at
org.junit.runners.BlockJUnit4ClassRunner.runChild(BlockJUnit4ClassRunner.java:47)
at org.junit.runners.ParentRunner$3.run(ParentRunner.java:231)
at org.junit.runners.ParentRunner$1.schedule(ParentRunner.java:60)
at org.junit.runners.ParentRunner.runChildren(ParentRunner.java:229)
at org.junit.runners.ParentRunner.access$000(ParentRunner.java:50)
at org.junit.runners.ParentRunner$2.evaluate(ParentRunner.java:222)
at org.junit.runners.ParentRunner.run(ParentRunner.java:300)
at
org.apache.maven.surefire.junit4.JUnit4Provider.execute(JUnit4Provider.java:236)
at
org.apache.maven.surefire.junit4.JUnit4Provider.executeTestSet(JUnit4Provider.java:134)
at
org.apache.maven.surefire.junit4.JUnit4Provider.invoke(JUnit4Provider.java:113)
at sun.reflect.NativeMethodAccessorImpl.invoke0(Native Method)
at
sun.reflect.NativeMethodAccessorImpl.invoke(NativeMethodAccessorImpl.java:57)
at
sun.reflect.DelegatingMethodAccessorImpl.invoke(DelegatingMethodAccessorImpl.java:43)
at java.lang.reflect.Method.invoke(Method.java:616)
at
org.apache.maven.surefire.util.ReflectionUtils.invokeMethodWithArray(ReflectionUtils.java:189)
at
org.apache.maven.surefire.booter.ProviderFactory$ProviderProxy.invoke(ProviderFactory.java:165)
at
org.apache.maven.surefire.booter.ProviderFactory.invokeProvider(ProviderFactory.java:85)
at
org.apache.maven.surefire.booter.ForkedBooter.runSuitesInProcess(ForkedBooter.java:103)
at org.apache.maven.surefire.booter.ForkedBooter.main(ForkedBooter.java:74)
runUploadSslCertBadkeyAlgo(org.apache.cloudstack.network.lb.CertServiceTest)
 Time elapsed: 0 sec  <<< ERROR!
java.io.FileNotFoundException: File
'/media/TV%26Movie/aca/cloudstack/server/target/test-classes/certs/rsa_self_signed.crt'
does not exist
at org.apache.commons.io.FileUtils.openInputStream(FileUtils.java:137)
at org.apache.commons.io.FileUtils.readFileToString(FileUtils.java:1102)
at org.apache.commons.io.FileUtils.readFileToString(FileUtils.java:1120)
at
org.apache.cloudstack.network.lb.CertServiceTest.runUploadSslCertBadkeyAlgo(CertServiceTest.java:474)
at sun.reflect.NativeMethodAccessorImpl.invoke0(Native Method)
at
sun.reflect.NativeMethodAccessorImpl.invoke(NativeMethodAccessorImpl.java:57)
at
sun.reflect.DelegatingMethodAccessorImpl.invoke(DelegatingMethodAccessorImpl.java:43)
at java.lang.reflect.Method.invoke(Method.java:616)
at
org.junit.runners.model.FrameworkMethod$1.runReflectiveCall(FrameworkMethod.java:45)
at
org.junit.internal.runners.model.ReflectiveCallable.run(ReflectiveCallable.java:15)
at
org.junit.runners.model.FrameworkMethod.invokeExplosively(FrameworkMethod.java:42)
at
org.junit.internal.runners.statements.InvokeMethod.evaluate(InvokeMethod.java:20)
at
org.junit.internal.runners.statements.RunBefores.evaluate(RunBefores.java:28)
at
org.junit.internal.runners.statements.RunAfters.evaluate(RunAfters.java:30)
at org.junit.runners.ParentRunner.runLeaf(ParentRunner.java:263)
at
org.junit.runners.BlockJUnit4ClassRunner.runChild(BlockJUnit4ClassRunner.java:68)
at
org.junit.runners.BlockJUnit4ClassRunner.runChild(BlockJUnit4ClassRunner.java:47)
at org.junit.runners.ParentRunner$3.run(ParentRunner.java:231)
at org.junit.runners.ParentRunner$1.schedule(ParentRunner.java:60)
at org.junit.runners.ParentRunner.runChildren(ParentRunner.java:229)
at org.junit.runners.ParentRunner.access$000(ParentRunner.java:50)
at org.junit.runners.ParentRunner$2.evaluate(ParentRunner.java:222)
at org.junit.runners.ParentRunner.run(ParentRunner.java:300)
at
org.apache.maven.surefire.junit4.JUnit4Provider.execute(JUnit4Provider.java:236)
at
org.apache.maven.surefire.junit4.JUnit4Provider.executeTestSet(JUnit4Provider.java:134)
at
org.apache.maven.surefire.junit4.JUnit4Provider.invoke(JUnit4Provider.java:113)
at sun.reflect.NativeMethodAccessorImpl.invoke0(Native Method)
at
sun.reflect.NativeMethodAccessorImpl.invoke(NativeMethodAccessorImpl.java:57)
at
sun.reflect.DelegatingMethodAccessorImpl.invoke(DelegatingMethodAccessorImpl.java:43)
at java.lang.reflect.Method.invoke(Method.java:616)
at
org.apache.maven.surefire.util.ReflectionUtils.invokeMethodWithArray(ReflectionUtils.java:189)
at
org.apache.maven.surefire.booter.ProviderFactory$ProviderProxy.invoke(ProviderFactory.java:165)
at
org.apache.maven.surefire.booter.ProviderFactory.invokeProvider(ProviderFactory.java:85)
at
org.apache.maven.surefire.booter.ForkedBooter.runSuitesInProcess(ForkedBooter.java:103)
at org.apache.maven.surefire.booter.ForkedBooter.main(ForkedBooter.java:74)
runUploadSslCertExpiredCert(org.apache.cloudstack.network.lb.CertServiceTest)
 Time elapsed: 0 sec  <<< ERROR!
java.io.FileNotFoundException: File
'/media/TV%26Movie/aca/cloudstack/server/target/test-classes/certs/expired_cert.crt'
does not exist
at org.apache.commons.io.FileUtils.openInputStream(FileUtils.java:137)
at org.apache.commons.io.FileUtils.readFileToString(FileUtils.java:1102)
at org.apache.commons.io.FileUtils.readFileToString(FileUtils.java:1120)
at
org.apache.cloudstack.network.lb.CertServiceTest.runUploadSslCertExpiredCert(CertServiceTest.java:514)
at sun.reflect.NativeMethodAccessorImpl.invoke0(Native Method)
at
sun.reflect.NativeMethodAccessorImpl.invoke(NativeMethodAccessorImpl.java:57)
at
sun.reflect.DelegatingMethodAccessorImpl.invoke(DelegatingMethodAccessorImpl.java:43)
at java.lang.reflect.Method.invoke(Method.java:616)
at
org.junit.runners.model.FrameworkMethod$1.runReflectiveCall(FrameworkMethod.java:45)
at
org.junit.internal.runners.model.ReflectiveCallable.run(ReflectiveCallable.java:15)
at
org.junit.runners.model.FrameworkMethod.invokeExplosively(FrameworkMethod.java:42)
at
org.junit.internal.runners.statements.InvokeMethod.evaluate(InvokeMethod.java:20)
at
org.junit.internal.runners.statements.RunBefores.evaluate(RunBefores.java:28)
at
org.junit.internal.runners.statements.RunAfters.evaluate(RunAfters.java:30)
at org.junit.runners.ParentRunner.runLeaf(ParentRunner.java:263)
at
org.junit.runners.BlockJUnit4ClassRunner.runChild(BlockJUnit4ClassRunner.java:68)
at
org.junit.runners.BlockJUnit4ClassRunner.runChild(BlockJUnit4ClassRunner.java:47)
at org.junit.runners.ParentRunner$3.run(ParentRunner.java:231)
at org.junit.runners.ParentRunner$1.schedule(ParentRunner.java:60)
at org.junit.runners.ParentRunner.runChildren(ParentRunner.java:229)
at org.junit.runners.ParentRunner.access$000(ParentRunner.java:50)
at org.junit.runners.ParentRunner$2.evaluate(ParentRunner.java:222)
at org.junit.runners.ParentRunner.run(ParentRunner.java:300)
at
org.apache.maven.surefire.junit4.JUnit4Provider.execute(JUnit4Provider.java:236)
at
org.apache.maven.surefire.junit4.JUnit4Provider.executeTestSet(JUnit4Provider.java:134)
at
org.apache.maven.surefire.junit4.JUnit4Provider.invoke(JUnit4Provider.java:113)
at sun.reflect.NativeMethodAccessorImpl.invoke0(Native Method)
at
sun.reflect.NativeMethodAccessorImpl.invoke(NativeMethodAccessorImpl.java:57)
at
sun.reflect.DelegatingMethodAccessorImpl.invoke(DelegatingMethodAccessorImpl.java:43)
at java.lang.reflect.Method.invoke(Method.java:616)
at
org.apache.maven.surefire.util.ReflectionUtils.invokeMethodWithArray(ReflectionUtils.java:189)
at
org.apache.maven.surefire.booter.ProviderFactory$ProviderProxy.invoke(ProviderFactory.java:165)
at
org.apache.maven.surefire.booter.ProviderFactory.invokeProvider(ProviderFactory.java:85)
at
org.apache.maven.surefire.booter.ForkedBooter.runSuitesInProcess(ForkedBooter.java:103)
at org.apache.maven.surefire.booter.ForkedBooter.main(ForkedBooter.java:74)
runUploadSslCertNotX509(org.apache.cloudstack.network.lb.CertServiceTest)
 Time elapsed: 0 sec  <<< ERROR!
java.io.FileNotFoundException: File
'/media/TV%26Movie/aca/cloudstack/server/target/test-classes/certs/non_x509_pem.crt'
does not exist
at org.apache.commons.io.FileUtils.openInputStream(FileUtils.java:137)
at org.apache.commons.io.FileUtils.readFileToString(FileUtils.java:1102)
at org.apache.commons.io.FileUtils.readFileToString(FileUtils.java:1120)
at
org.apache.cloudstack.network.lb.CertServiceTest.runUploadSslCertNotX509(CertServiceTest.java:553)
at sun.reflect.NativeMethodAccessorImpl.invoke0(Native Method)
at
sun.reflect.NativeMethodAccessorImpl.invoke(NativeMethodAccessorImpl.java:57)
at
sun.reflect.DelegatingMethodAccessorImpl.invoke(DelegatingMethodAccessorImpl.java:43)
at java.lang.reflect.Method.invoke(Method.java:616)
at
org.junit.runners.model.FrameworkMethod$1.runReflectiveCall(FrameworkMethod.java:45)
at
org.junit.internal.runners.model.ReflectiveCallable.run(ReflectiveCallable.java:15)
at
org.junit.runners.model.FrameworkMethod.invokeExplosively(FrameworkMethod.java:42)
at
org.junit.internal.runners.statements.InvokeMethod.evaluate(InvokeMethod.java:20)
at
org.junit.internal.runners.statements.RunBefores.evaluate(RunBefores.java:28)
at
org.junit.internal.runners.statements.RunAfters.evaluate(RunAfters.java:30)
at org.junit.runners.ParentRunner.runLeaf(ParentRunner.java:263)
at
org.junit.runners.BlockJUnit4ClassRunner.runChild(BlockJUnit4ClassRunner.java:68)
at
org.junit.runners.BlockJUnit4ClassRunner.runChild(BlockJUnit4ClassRunner.java:47)
at org.junit.runners.ParentRunner$3.run(ParentRunner.java:231)
at org.junit.runners.ParentRunner$1.schedule(ParentRunner.java:60)
at org.junit.runners.ParentRunner.runChildren(ParentRunner.java:229)
at org.junit.runners.ParentRunner.access$000(ParentRunner.java:50)
at org.junit.runners.ParentRunner$2.evaluate(ParentRunner.java:222)
at org.junit.runners.ParentRunner.run(ParentRunner.java:300)
at
org.apache.maven.surefire.junit4.JUnit4Provider.execute(JUnit4Provider.java:236)
at
org.apache.maven.surefire.junit4.JUnit4Provider.executeTestSet(JUnit4Provider.java:134)
at
org.apache.maven.surefire.junit4.JUnit4Provider.invoke(JUnit4Provider.java:113)
at sun.reflect.NativeMethodAccessorImpl.invoke0(Native Method)
at
sun.reflect.NativeMethodAccessorImpl.invoke(NativeMethodAccessorImpl.java:57)
at
sun.reflect.DelegatingMethodAccessorImpl.invoke(DelegatingMethodAccessorImpl.java:43)
at java.lang.reflect.Method.invoke(Method.java:616)
at
org.apache.maven.surefire.util.ReflectionUtils.invokeMethodWithArray(ReflectionUtils.java:189)
at
org.apache.maven.surefire.booter.ProviderFactory$ProviderProxy.invoke(ProviderFactory.java:165)
at
org.apache.maven.surefire.booter.ProviderFactory.invokeProvider(ProviderFactory.java:85)
at
org.apache.maven.surefire.booter.ForkedBooter.runSuitesInProcess(ForkedBooter.java:103)
at org.apache.maven.surefire.booter.ForkedBooter.main(ForkedBooter.java:74)
runUploadSslCertBadFormat(org.apache.cloudstack.network.lb.CertServiceTest)
 Time elapsed: 0 sec  <<< ERROR!
java.io.FileNotFoundException: File
'/media/TV%26Movie/aca/cloudstack/server/target/test-classes/certs/bad_format_cert.crt'
does not exist
at org.apache.commons.io.FileUtils.openInputStream(FileUtils.java:137)
at org.apache.commons.io.FileUtils.readFileToString(FileUtils.java:1102)
at org.apache.commons.io.FileUtils.readFileToString(FileUtils.java:1120)
at
org.apache.cloudstack.network.lb.CertServiceTest.runUploadSslCertBadFormat(CertServiceTest.java:593)
at sun.reflect.NativeMethodAccessorImpl.invoke0(Native Method)
at
sun.reflect.NativeMethodAccessorImpl.invoke(NativeMethodAccessorImpl.java:57)
at
sun.reflect.DelegatingMethodAccessorImpl.invoke(DelegatingMethodAccessorImpl.java:43)
at java.lang.reflect.Method.invoke(Method.java:616)
at
org.junit.runners.model.FrameworkMethod$1.runReflectiveCall(FrameworkMethod.java:45)
at
org.junit.internal.runners.model.ReflectiveCallable.run(ReflectiveCallable.java:15)
at
org.junit.runners.model.FrameworkMethod.invokeExplosively(FrameworkMethod.java:42)
at
org.junit.internal.runners.statements.InvokeMethod.evaluate(InvokeMethod.java:20)
at
org.junit.internal.runners.statements.RunBefores.evaluate(RunBefores.java:28)
at
org.junit.internal.runners.statements.RunAfters.evaluate(RunAfters.java:30)
at org.junit.runners.ParentRunner.runLeaf(ParentRunner.java:263)
at
org.junit.runners.BlockJUnit4ClassRunner.runChild(BlockJUnit4ClassRunner.java:68)
at
org.junit.runners.BlockJUnit4ClassRunner.runChild(BlockJUnit4ClassRunner.java:47)
at org.junit.runners.ParentRunner$3.run(ParentRunner.java:231)
at org.junit.runners.ParentRunner$1.schedule(ParentRunner.java:60)
at org.junit.runners.ParentRunner.runChildren(ParentRunner.java:229)
at org.junit.runners.ParentRunner.access$000(ParentRunner.java:50)
at org.junit.runners.ParentRunner$2.evaluate(ParentRunner.java:222)
at org.junit.runners.ParentRunner.run(ParentRunner.java:300)
at
org.apache.maven.surefire.junit4.JUnit4Provider.execute(JUnit4Provider.java:236)
at
org.apache.maven.surefire.junit4.JUnit4Provider.executeTestSet(JUnit4Provider.java:134)
at
org.apache.maven.surefire.junit4.JUnit4Provider.invoke(JUnit4Provider.java:113)
at sun.reflect.NativeMethodAccessorImpl.invoke0(Native Method)
at
sun.reflect.NativeMethodAccessorImpl.invoke(NativeMethodAccessorImpl.java:57)
at
sun.reflect.DelegatingMethodAccessorImpl.invoke(DelegatingMethodAccessorImpl.java:43)
at java.lang.reflect.Method.invoke(Method.java:616)
at
org.apache.maven.surefire.util.ReflectionUtils.invokeMethodWithArray(ReflectionUtils.java:189)
at
org.apache.maven.surefire.booter.ProviderFactory$ProviderProxy.invoke(ProviderFactory.java:165)
at
org.apache.maven.surefire.booter.ProviderFactory.invokeProvider(ProviderFactory.java:85)
at
org.apache.maven.surefire.booter.ForkedBooter.runSuitesInProcess(ForkedBooter.java:103)
at org.apache.maven.surefire.booter.ForkedBooter.main(ForkedBooter.java:74)

Dumindu Buddhika,
Undergraduate,
Department of Computer Science and Engineering,
University of Moratuwa,
Sri Lanka.
Mobile:+94715764749


On Tue, Dec 31, 2013 at 2:05 PM, Daan Hoogland <daan.hoogland@gmail.com>wrote:

> On Mon, Dec 30, 2013 at 2:25 PM, Dumindu Buddhika
> <dumindukarunathilaka@gmail.com> wrote:
> > ERROR] Please refer to
> > /media/TV&Movie/aca/cloudstack/server/target/surefire-reports for the
> > individual test results.
>
>
> did you look at the location above to find what the error is? The log
> suggests its related to ssl. I haven't build the master build in a
> while but I will probably this afternoon. I don't know of any
> prerequisites for building it.
>

Mime
  • Unnamed multipart/alternative (inline, None, 0 bytes)
View raw message