cloudstack-dev mailing list archives

Site index · List index
Message view « Date » · « Thread »
Top « Date » · « Thread »
From jenk...@cloudstack.org
Subject Build failed in Jenkins: cloudstack-4.3-maven-build #77
Date Fri, 06 Dec 2013 01:32:53 GMT
See <http://jenkins.buildacloud.org/job/cloudstack-4.3-maven-build/77/changes>

Changes:

[frank.zhang] commit 8edaf63c4e4a054b17a2dfe4233d103fb2ee9e6a

------------------------------------------
[...truncated 2265 lines...]
symbol  : class UcsTemplate
location: class com.cloud.ucs.manager.UcsManagerImpl
[ERROR] <http://jenkins.buildacloud.org/job/cloudstack-4.3-maven-build/ws/plugins/hypervisors/ucs/src/com/cloud/ucs/manager/UcsManagerImpl.java>:[313,62]
cannot find symbol
symbol  : class ListUcsTemplatesCmd
location: class com.cloud.ucs.manager.UcsManagerImpl
[ERROR] <http://jenkins.buildacloud.org/job/cloudstack-4.3-maven-build/ws/plugins/hypervisors/ucs/src/com/cloud/ucs/manager/UcsManagerImpl.java>:[313,24]
cannot find symbol
symbol  : class UcsTemplateResponse
location: class com.cloud.ucs.manager.UcsManagerImpl
[ERROR] <http://jenkins.buildacloud.org/job/cloudstack-4.3-maven-build/ws/plugins/hypervisors/ucs/src/com/cloud/ucs/manager/UcsManagerImpl.java>:[416,67]
cannot find symbol
symbol  : class InstantiateUcsTemplateAndAssociateToBladeCmd
location: class com.cloud.ucs.manager.UcsManagerImpl
[ERROR] <http://jenkins.buildacloud.org/job/cloudstack-4.3-maven-build/ws/plugins/hypervisors/ucs/src/com/cloud/ucs/manager/UcsManagerImpl.java>:[638,48]
cannot find symbol
symbol  : class DisassociateUcsProfileCmd
location: class com.cloud.ucs.manager.UcsManagerImpl
[ERROR] <http://jenkins.buildacloud.org/job/cloudstack-4.3-maven-build/ws/plugins/hypervisors/ucs/src/com/cloud/ucs/manager/UcsManagerImpl.java>:[283,13]
cannot find symbol
symbol  : class UcsTemplate
location: class com.cloud.ucs.manager.UcsManagerImpl
[ERROR] <http://jenkins.buildacloud.org/job/cloudstack-4.3-maven-build/ws/plugins/hypervisors/ucs/src/com/cloud/ucs/manager/UcsManagerImpl.java>:[283,33]
cannot find symbol
symbol  : variable UcsTemplate
location: class com.cloud.ucs.manager.UcsManagerImpl
[ERROR] <http://jenkins.buildacloud.org/job/cloudstack-4.3-maven-build/ws/plugins/hypervisors/ucs/src/com/cloud/ucs/manager/UcsManagerImpl.java>:[293,13]
cannot find symbol
symbol  : class UcsTemplate
location: class com.cloud.ucs.manager.UcsManagerImpl
[ERROR] <http://jenkins.buildacloud.org/job/cloudstack-4.3-maven-build/ws/plugins/hypervisors/ucs/src/com/cloud/ucs/manager/UcsManagerImpl.java>:[293,33]
cannot find symbol
symbol  : variable UcsTemplate
location: class com.cloud.ucs.manager.UcsManagerImpl
[ERROR] <http://jenkins.buildacloud.org/job/cloudstack-4.3-maven-build/ws/plugins/hypervisors/ucs/src/com/cloud/ucs/manager/UcsManagerImpl.java>:[314,13]
cannot find symbol
symbol  : class UcsTemplate
location: class com.cloud.ucs.manager.UcsManagerImpl
[ERROR] <http://jenkins.buildacloud.org/job/cloudstack-4.3-maven-build/ws/plugins/hypervisors/ucs/src/com/cloud/ucs/manager/UcsManagerImpl.java>:[315,21]
cannot find symbol
symbol  : class UcsTemplateResponse
location: class com.cloud.ucs.manager.UcsManagerImpl
[ERROR] <http://jenkins.buildacloud.org/job/cloudstack-4.3-maven-build/ws/plugins/hypervisors/ucs/src/com/cloud/ucs/manager/UcsManagerImpl.java>:[315,70]
cannot find symbol
symbol  : class UcsTemplateResponse
location: class com.cloud.ucs.manager.UcsManagerImpl
[ERROR] <http://jenkins.buildacloud.org/job/cloudstack-4.3-maven-build/ws/plugins/hypervisors/ucs/src/com/cloud/ucs/manager/UcsManagerImpl.java>:[316,13]
cannot find symbol
symbol  : class UcsTemplateResponse
location: class com.cloud.ucs.manager.UcsManagerImpl
[ERROR] <http://jenkins.buildacloud.org/job/cloudstack-4.3-maven-build/ws/plugins/hypervisors/ucs/src/com/cloud/ucs/manager/UcsManagerImpl.java>:[316,53]
cannot find symbol
symbol  : class UcsTemplateResponse
location: class com.cloud.ucs.manager.UcsManagerImpl
[ERROR] <http://jenkins.buildacloud.org/job/cloudstack-4.3-maven-build/ws/plugins/hypervisors/ucs/src/com/cloud/ucs/manager/UcsManagerImpl.java>:[317,13]
cannot find symbol
symbol  : class UcsTemplate
location: class com.cloud.ucs.manager.UcsManagerImpl
[ERROR] <http://jenkins.buildacloud.org/job/cloudstack-4.3-maven-build/ws/plugins/hypervisors/ucs/src/com/cloud/ucs/manager/UcsManagerImpl.java>:[318,12]
cannot find symbol
symbol  : class UcsTemplateResponse
location: class com.cloud.ucs.manager.UcsManagerImpl
[ERROR] <http://jenkins.buildacloud.org/job/cloudstack-4.3-maven-build/ws/plugins/hypervisors/ucs/src/com/cloud/ucs/manager/UcsManagerImpl.java>:[318,40]
cannot find symbol
symbol  : class UcsTemplateResponse
location: class com.cloud.ucs.manager.UcsManagerImpl
[ERROR] <http://jenkins.buildacloud.org/job/cloudstack-4.3-maven-build/ws/plugins/hypervisors/ucs/src/com/cloud/ucs/manager/UcsManagerImpl.java>:[591,17]
cannot find symbol
symbol  : class DisassociateUcsProfileCmd
location: class com.cloud.ucs.manager.UcsManagerImpl
[ERROR] <http://jenkins.buildacloud.org/job/cloudstack-4.3-maven-build/ws/plugins/hypervisors/ucs/src/com/cloud/ucs/manager/UcsManagerImpl.java>:[592,17]
cannot find symbol
symbol  : class RefreshUcsBladesCmd
location: class com.cloud.ucs.manager.UcsManagerImpl
[ERROR] <http://jenkins.buildacloud.org/job/cloudstack-4.3-maven-build/ws/plugins/hypervisors/ucs/src/com/cloud/ucs/manager/UcsManagerImpl.java>:[593,17]
cannot find symbol
symbol  : class ListUcsTemplatesCmd
location: class com.cloud.ucs.manager.UcsManagerImpl
[ERROR] <http://jenkins.buildacloud.org/job/cloudstack-4.3-maven-build/ws/plugins/hypervisors/ucs/src/com/cloud/ucs/manager/UcsManagerImpl.java>:[594,17]
cannot find symbol
symbol  : class InstantiateUcsTemplateAndAssociateToBladeCmd
location: class com.cloud.ucs.manager.UcsManagerImpl
[INFO] 26 errors 
[INFO] -------------------------------------------------------------
[INFO] ------------------------------------------------------------------------
[INFO] Reactor Summary:
[INFO] 
[INFO] Apache CloudStack ................................. SUCCESS [1.675s]
[INFO] Apache CloudStack Maven Conventions Parent ........ SUCCESS [0.079s]
[INFO] Apache CloudStack Framework - Managed Context ..... SUCCESS [3.887s]
[INFO] Apache CloudStack Utils ........................... SUCCESS [11.785s]
[INFO] Apache CloudStack Framework ....................... SUCCESS [0.032s]
[INFO] Apache CloudStack Framework - Event Notification .. SUCCESS [6.371s]
[INFO] Apache CloudStack Framework - Configuration ....... SUCCESS [4.748s]
[INFO] Apache CloudStack API ............................. SUCCESS [14.723s]
[INFO] Apache CloudStack Framework - REST ................ SUCCESS [3.480s]
[INFO] Apache CloudStack Framework - IPC ................. SUCCESS [6.807s]
[INFO] Apache CloudStack Cloud Engine .................... SUCCESS [0.047s]
[INFO] Apache CloudStack Cloud Engine API ................ SUCCESS [6.387s]
[INFO] Apache CloudStack Core ............................ SUCCESS [9.056s]
[INFO] Apache CloudStack Agents .......................... SUCCESS [6.340s]
[INFO] Apache CloudStack Framework - Clustering .......... SUCCESS [3.534s]
[INFO] Apache CloudStack Framework - Jobs ................ SUCCESS [4.131s]
[INFO] Apache CloudStack Cloud Engine Schema Component ... SUCCESS [11.191s]
[INFO] Apache CloudStack Framework - Event Notification .. SUCCESS [2.312s]
[INFO] Apache CloudStack Cloud Engine Internal Components API  SUCCESS [3.589s]
[INFO] Apache CloudStack Server .......................... SUCCESS [47.850s]
[INFO] Apache CloudStack Usage Server .................... SUCCESS [8.536s]
[INFO] Apache XenSource XAPI ............................. SUCCESS [7.635s]
[INFO] Apache CloudStack Cloud Engine Orchestration Component  SUCCESS [14.065s]
[INFO] Apache CloudStack Cloud Services .................. SUCCESS [0.040s]
[INFO] Apache CloudStack Secondary Storage Service ....... SUCCESS [11.338s]
[INFO] Apache CloudStack Engine Storage Component ........ SUCCESS [10.884s]
[INFO] Apache CloudStack Engine Storage Volume Component . SUCCESS [6.803s]
[INFO] Apache CloudStack Engine Storage Image Component .. SUCCESS [4.713s]
[INFO] Apache CloudStack Engine Storage Data Motion Component  SUCCESS [6.004s]
[INFO] Apache CloudStack Engine Storage Cache Component .. SUCCESS [4.542s]
[INFO] Apache CloudStack Engine Storage Snapshot Component  SUCCESS [12.123s]
[INFO] Apache CloudStack Cloud Engine API ................ SUCCESS [2.931s]
[INFO] Apache CloudStack Cloud Engine Service ............ SUCCESS [2.146s]
[INFO] Apache CloudStack Plugin POM ...................... SUCCESS [0.681s]
[INFO] Apache CloudStack Plugin - API Rate Limit ......... SUCCESS [10.865s]
[INFO] Apache CloudStack Plugin - API Discovery .......... SUCCESS [9.518s]
[INFO] Apache CloudStack Plugin - ACL Static Role Based .. SUCCESS [3.490s]
[INFO] Apache CloudStack Plugin - Host Anti-Affinity Processor  SUCCESS [2.634s]
[INFO] Apache CloudStack Plugin - Explicit Dedication Processor  SUCCESS [3.060s]
[INFO] Apache CloudStack Plugin - User Concentrated Pod Deployment Planner  SUCCESS [2.675s]
[INFO] Apache CloudStack Plugin - User Dispersing Deployment Planner  SUCCESS [2.406s]
[INFO] Apache CloudStack Plugin - Implicit Dedication Planner  SUCCESS [8.852s]
[INFO] Apache CloudStack Plugin - Host Allocator Random .. SUCCESS [2.711s]
[INFO] Apache CloudStack Plugin - Dedicated Resources .... SUCCESS [7.993s]
[INFO] Apache CloudStack Plugin - Hypervisor OracleVM .... SUCCESS [4.140s]
[INFO] Apache CloudStack Plugin - Open vSwitch ........... SUCCESS [3.389s]
[INFO] Apache CloudStack Plugin - Hypervisor Xen ......... SUCCESS [12.065s]
[INFO] Apache CloudStack Plugin - Hypervisor KVM ......... SUCCESS [9.823s]
[INFO] Apache CloudStack Plugin - RabbitMQ Event Bus ..... SUCCESS [2.857s]
[INFO] Apache CloudStack Plugin - Hypervisor Baremetal ... SUCCESS [5.396s]
[INFO] Apache CloudStack Plugin - Hypervisor UCS ......... FAILURE [2.686s]
[INFO] Apache CloudStack Plugin - Hypervisor Hyper-V ..... SKIPPED
[INFO] Apache CloudStack Plugin - Network Elastic Load Balancer  SKIPPED
[INFO] Apache CloudStack Plugin - Network Internal Load Balancer  SKIPPED
[INFO] Apache CloudStack Plugin - Network Juniper Contrail  SKIPPED
[INFO] Apache CloudStack Plugin - Palo Alto .............. SKIPPED
[INFO] Apache CloudStack Checkstyle Configuration ........ SKIPPED
[INFO] Apache CloudStack Plugin - Network Nicira NVP ..... SKIPPED
[INFO] Apache CloudStack Plugin - BigSwitch Virtual Network Segment  SKIPPED
[INFO] Apache CloudStack Plugin - Midokura Midonet ....... SKIPPED
[INFO] Apache Cloudstack Plugin - Stratosphere SSP ....... SKIPPED
[INFO] Apache CloudStack Plugin - Storage Allocator Random  SKIPPED
[INFO] Apache CloudStack Plugin - User Authenticator LDAP  SKIPPED
[INFO] Apache CloudStack Plugin - User Authenticator MD5 . SKIPPED
[INFO] Apache CloudStack Plugin - User Authenticator Plain Text  SKIPPED
[INFO] Apache CloudStack Plugin - User Authenticator SHA256 Salted  SKIPPED
[INFO] Apache CloudStack Plugin - Dns Notifier Example ... SKIPPED
[INFO] Apache CloudStack Plugin - Storage Image S3 ....... SKIPPED
[INFO] Apache CloudStack Plugin - Storage Image Swift provider  SKIPPED
[INFO] Apache CloudStack Plugin - Storage Image default provider  SKIPPED
[INFO] Apache CloudStack Plugin - Storage Image sample provider  SKIPPED
[INFO] Apache CloudStack Plugin - Storage Volume SolidFire Provider  SKIPPED
[INFO] Apache CloudStack Plugin - Storage Volume default provider  SKIPPED
[INFO] Apache CloudStack Plugin - Storage Volume sample provider  SKIPPED
[INFO] Apache CloudStack Plugin - SNMP Alerts ............ SKIPPED
[INFO] Apache CloudStack Plugin - Syslog Alerts .......... SKIPPED
[INFO] Apache CloudStack Plugin - Network VXLAN .......... SKIPPED
[INFO] Apache CloudStack Framework - Spring Life Cycle ... SKIPPED
[INFO] cloud-framework-spring-module ..................... SKIPPED
[INFO] Apache CloudStack Test ............................ SKIPPED
[INFO] Apache CloudStack Client UI ....................... SKIPPED
[INFO] Apache CloudStack Console Proxy ................... SKIPPED
[INFO] Apache CloudStack Console Proxy - Server .......... SKIPPED
[INFO] Apache CloudStack Console Proxy - RDP Client ...... SKIPPED
[INFO] Apache CloudStack Framework - QuickCloud .......... SKIPPED
[INFO] ------------------------------------------------------------------------
[INFO] BUILD FAILURE
[INFO] ------------------------------------------------------------------------
[INFO] Total time: 5:38.590s
[INFO] Finished at: Thu Dec 05 20:31:03 EST 2013
[INFO] Final Memory: 43M/272M
[INFO] ------------------------------------------------------------------------
[ERROR] Failed to execute goal org.apache.maven.plugins:maven-compiler-plugin:2.5.1:compile
(default-compile) on project cloud-plugin-hypervisor-ucs: Compilation failure: Compilation
failure:
[ERROR] <http://jenkins.buildacloud.org/job/cloudstack-4.3-maven-build/ws/plugins/hypervisors/ucs/src/com/cloud/ucs/manager/UcsManager.java>:[31,55]
cannot find symbol
[ERROR] symbol  : class ListUcsTemplatesCmd
[ERROR] location: interface com.cloud.ucs.manager.UcsManager
[ERROR] <http://jenkins.buildacloud.org/job/cloudstack-4.3-maven-build/ws/plugins/hypervisors/ucs/src/com/cloud/ucs/manager/UcsManager.java>:[31,17]
cannot find symbol
[ERROR] symbol  : class UcsTemplateResponse
[ERROR] location: interface com.cloud.ucs.manager.UcsManager
[ERROR] <http://jenkins.buildacloud.org/job/cloudstack-4.3-maven-build/ws/plugins/hypervisors/ucs/src/com/cloud/ucs/manager/UcsManager.java>:[37,60]
cannot find symbol
[ERROR] symbol  : class InstantiateUcsTemplateAndAssociateToBladeCmd
[ERROR] location: interface com.cloud.ucs.manager.UcsManager
[ERROR] <http://jenkins.buildacloud.org/job/cloudstack-4.3-maven-build/ws/plugins/hypervisors/ucs/src/com/cloud/ucs/manager/UcsManager.java>:[45,41]
cannot find symbol
[ERROR] symbol  : class DisassociateUcsProfileCmd
[ERROR] location: interface com.cloud.ucs.manager.UcsManager
[ERROR] <http://jenkins.buildacloud.org/job/cloudstack-4.3-maven-build/ws/plugins/hypervisors/ucs/src/com/cloud/ucs/manager/UcsManagerImpl.java>:[35,30]
cannot find symbol
[ERROR] symbol  : class UcsTemplate
[ERROR] location: package com.cloud.ucs.structure
[ERROR] <http://jenkins.buildacloud.org/job/cloudstack-4.3-maven-build/ws/plugins/hypervisors/ucs/src/com/cloud/ucs/manager/UcsManagerImpl.java>:[277,17]
cannot find symbol
[ERROR] symbol  : class UcsTemplate
[ERROR] location: class com.cloud.ucs.manager.UcsManagerImpl
[ERROR] <http://jenkins.buildacloud.org/job/cloudstack-4.3-maven-build/ws/plugins/hypervisors/ucs/src/com/cloud/ucs/manager/UcsManagerImpl.java>:[313,62]
cannot find symbol
[ERROR] symbol  : class ListUcsTemplatesCmd
[ERROR] location: class com.cloud.ucs.manager.UcsManagerImpl
[ERROR] <http://jenkins.buildacloud.org/job/cloudstack-4.3-maven-build/ws/plugins/hypervisors/ucs/src/com/cloud/ucs/manager/UcsManagerImpl.java>:[313,24]
cannot find symbol
[ERROR] symbol  : class UcsTemplateResponse
[ERROR] location: class com.cloud.ucs.manager.UcsManagerImpl
[ERROR] <http://jenkins.buildacloud.org/job/cloudstack-4.3-maven-build/ws/plugins/hypervisors/ucs/src/com/cloud/ucs/manager/UcsManagerImpl.java>:[416,67]
cannot find symbol
[ERROR] symbol  : class InstantiateUcsTemplateAndAssociateToBladeCmd
[ERROR] location: class com.cloud.ucs.manager.UcsManagerImpl
[ERROR] <http://jenkins.buildacloud.org/job/cloudstack-4.3-maven-build/ws/plugins/hypervisors/ucs/src/com/cloud/ucs/manager/UcsManagerImpl.java>:[638,48]
cannot find symbol
[ERROR] symbol  : class DisassociateUcsProfileCmd
[ERROR] location: class com.cloud.ucs.manager.UcsManagerImpl
[ERROR] <http://jenkins.buildacloud.org/job/cloudstack-4.3-maven-build/ws/plugins/hypervisors/ucs/src/com/cloud/ucs/manager/UcsManagerImpl.java>:[283,13]
cannot find symbol
[ERROR] symbol  : class UcsTemplate
[ERROR] location: class com.cloud.ucs.manager.UcsManagerImpl
[ERROR] <http://jenkins.buildacloud.org/job/cloudstack-4.3-maven-build/ws/plugins/hypervisors/ucs/src/com/cloud/ucs/manager/UcsManagerImpl.java>:[283,33]
cannot find symbol
[ERROR] symbol  : variable UcsTemplate
[ERROR] location: class com.cloud.ucs.manager.UcsManagerImpl
[ERROR] <http://jenkins.buildacloud.org/job/cloudstack-4.3-maven-build/ws/plugins/hypervisors/ucs/src/com/cloud/ucs/manager/UcsManagerImpl.java>:[293,13]
cannot find symbol
[ERROR] symbol  : class UcsTemplate
[ERROR] location: class com.cloud.ucs.manager.UcsManagerImpl
[ERROR] <http://jenkins.buildacloud.org/job/cloudstack-4.3-maven-build/ws/plugins/hypervisors/ucs/src/com/cloud/ucs/manager/UcsManagerImpl.java>:[293,33]
cannot find symbol
[ERROR] symbol  : variable UcsTemplate
[ERROR] location: class com.cloud.ucs.manager.UcsManagerImpl
[ERROR] <http://jenkins.buildacloud.org/job/cloudstack-4.3-maven-build/ws/plugins/hypervisors/ucs/src/com/cloud/ucs/manager/UcsManagerImpl.java>:[314,13]
cannot find symbol
[ERROR] symbol  : class UcsTemplate
[ERROR] location: class com.cloud.ucs.manager.UcsManagerImpl
[ERROR] <http://jenkins.buildacloud.org/job/cloudstack-4.3-maven-build/ws/plugins/hypervisors/ucs/src/com/cloud/ucs/manager/UcsManagerImpl.java>:[315,21]
cannot find symbol
[ERROR] symbol  : class UcsTemplateResponse
[ERROR] location: class com.cloud.ucs.manager.UcsManagerImpl
[ERROR] <http://jenkins.buildacloud.org/job/cloudstack-4.3-maven-build/ws/plugins/hypervisors/ucs/src/com/cloud/ucs/manager/UcsManagerImpl.java>:[315,70]
cannot find symbol
[ERROR] symbol  : class UcsTemplateResponse
[ERROR] location: class com.cloud.ucs.manager.UcsManagerImpl
[ERROR] <http://jenkins.buildacloud.org/job/cloudstack-4.3-maven-build/ws/plugins/hypervisors/ucs/src/com/cloud/ucs/manager/UcsManagerImpl.java>:[316,13]
cannot find symbol
[ERROR] symbol  : class UcsTemplateResponse
[ERROR] location: class com.cloud.ucs.manager.UcsManagerImpl
[ERROR] <http://jenkins.buildacloud.org/job/cloudstack-4.3-maven-build/ws/plugins/hypervisors/ucs/src/com/cloud/ucs/manager/UcsManagerImpl.java>:[316,53]
cannot find symbol
[ERROR] symbol  : class UcsTemplateResponse
[ERROR] location: class com.cloud.ucs.manager.UcsManagerImpl
[ERROR] <http://jenkins.buildacloud.org/job/cloudstack-4.3-maven-build/ws/plugins/hypervisors/ucs/src/com/cloud/ucs/manager/UcsManagerImpl.java>:[317,13]
cannot find symbol
[ERROR] symbol  : class UcsTemplate
[ERROR] location: class com.cloud.ucs.manager.UcsManagerImpl
[ERROR] <http://jenkins.buildacloud.org/job/cloudstack-4.3-maven-build/ws/plugins/hypervisors/ucs/src/com/cloud/ucs/manager/UcsManagerImpl.java>:[318,12]
cannot find symbol
[ERROR] symbol  : class UcsTemplateResponse
[ERROR] location: class com.cloud.ucs.manager.UcsManagerImpl
[ERROR] <http://jenkins.buildacloud.org/job/cloudstack-4.3-maven-build/ws/plugins/hypervisors/ucs/src/com/cloud/ucs/manager/UcsManagerImpl.java>:[318,40]
cannot find symbol
[ERROR] symbol  : class UcsTemplateResponse
[ERROR] location: class com.cloud.ucs.manager.UcsManagerImpl
[ERROR] <http://jenkins.buildacloud.org/job/cloudstack-4.3-maven-build/ws/plugins/hypervisors/ucs/src/com/cloud/ucs/manager/UcsManagerImpl.java>:[591,17]
cannot find symbol
[ERROR] symbol  : class DisassociateUcsProfileCmd
[ERROR] location: class com.cloud.ucs.manager.UcsManagerImpl
[ERROR] <http://jenkins.buildacloud.org/job/cloudstack-4.3-maven-build/ws/plugins/hypervisors/ucs/src/com/cloud/ucs/manager/UcsManagerImpl.java>:[592,17]
cannot find symbol
[ERROR] symbol  : class RefreshUcsBladesCmd
[ERROR] location: class com.cloud.ucs.manager.UcsManagerImpl
[ERROR] <http://jenkins.buildacloud.org/job/cloudstack-4.3-maven-build/ws/plugins/hypervisors/ucs/src/com/cloud/ucs/manager/UcsManagerImpl.java>:[593,17]
cannot find symbol
[ERROR] symbol  : class ListUcsTemplatesCmd
[ERROR] location: class com.cloud.ucs.manager.UcsManagerImpl
[ERROR] <http://jenkins.buildacloud.org/job/cloudstack-4.3-maven-build/ws/plugins/hypervisors/ucs/src/com/cloud/ucs/manager/UcsManagerImpl.java>:[594,17]
cannot find symbol
[ERROR] symbol  : class InstantiateUcsTemplateAndAssociateToBladeCmd
[ERROR] location: class com.cloud.ucs.manager.UcsManagerImpl
[ERROR] -> [Help 1]
[ERROR] 
[ERROR] To see the full stack trace of the errors, re-run Maven with the -e switch.
[ERROR] Re-run Maven using the -X switch to enable full debug logging.
[ERROR] 
[ERROR] For more information about the errors and possible solutions, please read the following
articles:
[ERROR] [Help 1] http://cwiki.apache.org/confluence/display/MAVEN/MojoFailureException
[ERROR] 
[ERROR] After correcting the problems, you can resume the build with the command
[ERROR]   mvn <goals> -rf :cloud-plugin-hypervisor-ucs
Build step 'Invoke top-level Maven targets' marked build as failure

Mime
View raw message