cloudstack-dev mailing list archives

Site index · List index
Message view « Date » · « Thread »
Top « Date » · « Thread »
From jenk...@cloudstack.org
Subject Build failed in Jenkins: cloudstack-4.3-maven-build #58
Date Wed, 04 Dec 2013 23:01:49 GMT
See <http://jenkins.buildacloud.org/job/cloudstack-4.3-maven-build/58/changes>

Changes:

[nitin.mehta] CLOUDSTACK-5352:

[jessicawang] CLOUDSTACK-5139: UI > Infrastructure > Secondary Storage > Add Secondary
Storage > providers dropdown - hardcode options instead of get them from listStorageProviders&type=image
since not all of returned values are handled by UI (e.g. "NetApp" is not handled by UI).

------------------------------------------
[...truncated 1956 lines...]
-------------------------------------------------------
 T E S T S
-------------------------------------------------------
Running org.apache.cloudstack.dedicated.manager.DedicatedApiUnitTest
log4j:WARN No appenders could be found for logger (org.springframework.test.context.junit4.SpringJUnit4ClassRunner).
log4j:WARN Please initialize the log4j system properly.
log4j:WARN See http://logging.apache.org/log4j/1.2/faq.html#noconfig for more info.
Tests run: 10, Failures: 0, Errors: 0, Skipped: 0, Time elapsed: 2.437 sec

Results :

Tests run: 10, Failures: 0, Errors: 0, Skipped: 0

[INFO]                                                                         
[INFO] ------------------------------------------------------------------------
[INFO] Building Apache CloudStack Plugin - Hypervisor OracleVM 4.3.0-SNAPSHOT
[INFO] ------------------------------------------------------------------------
[INFO] 
[INFO] --- maven-clean-plugin:2.5:clean (default-clean) @ cloud-plugin-hypervisor-ovm ---
[INFO] Deleting <http://jenkins.buildacloud.org/job/cloudstack-4.3-maven-build/ws/plugins/hypervisors/ovm/target>
(includes = [**/*], excludes = [])
[INFO] Deleting <http://jenkins.buildacloud.org/job/cloudstack-4.3-maven-build/ws/plugins/hypervisors/ovm>
(includes = [target, dist], excludes = [])
[INFO] 
[INFO] --- maven-remote-resources-plugin:1.3:process (default) @ cloud-plugin-hypervisor-ovm
---
[INFO] 
[INFO] --- maven-resources-plugin:2.5:resources (default-resources) @ cloud-plugin-hypervisor-ovm
---
[debug] execute contextualize
[INFO] Using 'UTF-8' encoding to copy filtered resources.
[INFO] Copying 4 resources
[INFO] Copying 3 resources
[INFO] 
[INFO] --- maven-compiler-plugin:2.5.1:compile (default-compile) @ cloud-plugin-hypervisor-ovm
---
[INFO] Compiling 18 source files to <http://jenkins.buildacloud.org/job/cloudstack-4.3-maven-build/ws/plugins/hypervisors/ovm/target/classes>
[INFO] 
[INFO] --- maven-resources-plugin:2.5:testResources (default-testResources) @ cloud-plugin-hypervisor-ovm
---
[debug] execute contextualize
[INFO] Using 'UTF-8' encoding to copy filtered resources.
[INFO] skip non existing resourceDirectory <http://jenkins.buildacloud.org/job/cloudstack-4.3-maven-build/ws/plugins/hypervisors/ovm/test/resources>
[INFO] Copying 3 resources
[INFO] 
[INFO] --- maven-compiler-plugin:2.5.1:testCompile (default-testCompile) @ cloud-plugin-hypervisor-ovm
---
[INFO] No sources to compile
[INFO] 
[INFO] --- maven-surefire-plugin:2.12:test (default-test) @ cloud-plugin-hypervisor-ovm ---
[INFO] Surefire report directory: <http://jenkins.buildacloud.org/job/cloudstack-4.3-maven-build/ws/plugins/hypervisors/ovm/target/surefire-reports>

-------------------------------------------------------
 T E S T S
-------------------------------------------------------

Results :

Tests run: 0, Failures: 0, Errors: 0, Skipped: 0

[INFO]                                                                         
[INFO] ------------------------------------------------------------------------
[INFO] Building Apache CloudStack Plugin - Open vSwitch 4.3.0-SNAPSHOT
[INFO] ------------------------------------------------------------------------
[INFO] 
[INFO] --- maven-clean-plugin:2.5:clean (default-clean) @ cloud-plugin-network-ovs ---
[INFO] Deleting <http://jenkins.buildacloud.org/job/cloudstack-4.3-maven-build/ws/plugins/network-elements/ovs/target>
(includes = [**/*], excludes = [])
[INFO] Deleting <http://jenkins.buildacloud.org/job/cloudstack-4.3-maven-build/ws/plugins/network-elements/ovs>
(includes = [target, dist], excludes = [])
[INFO] 
[INFO] --- maven-remote-resources-plugin:1.3:process (default) @ cloud-plugin-network-ovs
---
[INFO] 
[INFO] --- maven-resources-plugin:2.5:resources (default-resources) @ cloud-plugin-network-ovs
---
[debug] execute contextualize
[INFO] Using 'UTF-8' encoding to copy filtered resources.
[INFO] Copying 2 resources
[INFO] Copying 3 resources
[INFO] 
[INFO] --- maven-compiler-plugin:2.5.1:compile (default-compile) @ cloud-plugin-network-ovs
---
[INFO] Compiling 23 source files to <http://jenkins.buildacloud.org/job/cloudstack-4.3-maven-build/ws/plugins/network-elements/ovs/target/classes>
[INFO] 
[INFO] --- maven-resources-plugin:2.5:testResources (default-testResources) @ cloud-plugin-network-ovs
---
[debug] execute contextualize
[INFO] Using 'UTF-8' encoding to copy filtered resources.
[INFO] skip non existing resourceDirectory <http://jenkins.buildacloud.org/job/cloudstack-4.3-maven-build/ws/plugins/network-elements/ovs/test/resources>
[INFO] Copying 3 resources
[INFO] 
[INFO] --- maven-compiler-plugin:2.5.1:testCompile (default-testCompile) @ cloud-plugin-network-ovs
---
[INFO] No sources to compile
[INFO] 
[INFO] --- maven-surefire-plugin:2.12:test (default-test) @ cloud-plugin-network-ovs ---
[INFO] Surefire report directory: <http://jenkins.buildacloud.org/job/cloudstack-4.3-maven-build/ws/plugins/network-elements/ovs/target/surefire-reports>

-------------------------------------------------------
 T E S T S
-------------------------------------------------------

Results :

Tests run: 0, Failures: 0, Errors: 0, Skipped: 0

[INFO]                                                                         
[INFO] ------------------------------------------------------------------------
[INFO] Building Apache CloudStack Plugin - Hypervisor Xen 4.3.0-SNAPSHOT
[INFO] ------------------------------------------------------------------------
[INFO] 
[INFO] --- maven-clean-plugin:2.5:clean (default-clean) @ cloud-plugin-hypervisor-xen ---
[INFO] Deleting <http://jenkins.buildacloud.org/job/cloudstack-4.3-maven-build/ws/plugins/hypervisors/xen/target>
(includes = [**/*], excludes = [])
[INFO] Deleting <http://jenkins.buildacloud.org/job/cloudstack-4.3-maven-build/ws/plugins/hypervisors/xen>
(includes = [target, dist], excludes = [])
[INFO] 
[INFO] --- maven-remote-resources-plugin:1.3:process (default) @ cloud-plugin-hypervisor-xen
---
[INFO] 
[INFO] --- maven-resources-plugin:2.5:resources (default-resources) @ cloud-plugin-hypervisor-xen
---
[debug] execute contextualize
[INFO] Using 'UTF-8' encoding to copy filtered resources.
[INFO] Copying 4 resources
[INFO] Copying 3 resources
[INFO] 
[INFO] --- maven-compiler-plugin:2.5.1:compile (default-compile) @ cloud-plugin-hypervisor-xen
---
[INFO] Compiling 19 source files to <http://jenkins.buildacloud.org/job/cloudstack-4.3-maven-build/ws/plugins/hypervisors/xen/target/classes>
[INFO] 
[INFO] --- maven-resources-plugin:2.5:testResources (default-testResources) @ cloud-plugin-hypervisor-xen
---
[debug] execute contextualize
[INFO] Using 'UTF-8' encoding to copy filtered resources.
[INFO] skip non existing resourceDirectory <http://jenkins.buildacloud.org/job/cloudstack-4.3-maven-build/ws/plugins/hypervisors/xen/test/resources>
[INFO] Copying 3 resources
[INFO] 
[INFO] --- maven-compiler-plugin:2.5.1:testCompile (default-testCompile) @ cloud-plugin-hypervisor-xen
---
[INFO] Compiling 1 source file to <http://jenkins.buildacloud.org/job/cloudstack-4.3-maven-build/ws/plugins/hypervisors/xen/target/test-classes>
[INFO] 
[INFO] --- maven-surefire-plugin:2.12:test (default-test) @ cloud-plugin-hypervisor-xen ---
[INFO] Surefire report directory: <http://jenkins.buildacloud.org/job/cloudstack-4.3-maven-build/ws/plugins/hypervisors/xen/target/surefire-reports>

-------------------------------------------------------
 T E S T S
-------------------------------------------------------
Running com.cloud.hypervisor.xen.resource.CitrixResourceBaseTest
log4j:WARN No appenders could be found for logger (com.cloud.hypervisor.xen.resource.XenServerConnectionPool).
log4j:WARN Please initialize the log4j system properly.
log4j:WARN See http://logging.apache.org/log4j/1.2/faq.html#noconfig for more info.
Tests run: 3, Failures: 1, Errors: 0, Skipped: 0, Time elapsed: 1.281 sec <<< FAILURE!

Results :

Failed tests:   testScaleVMF3(com.cloud.hypervisor.xen.resource.CitrixResourceBaseTest): (..)

Tests run: 3, Failures: 1, Errors: 0, Skipped: 0

[INFO] ------------------------------------------------------------------------
[INFO] Reactor Summary:
[INFO] 
[INFO] Apache CloudStack ................................. SUCCESS [1.775s]
[INFO] Apache CloudStack Maven Conventions Parent ........ SUCCESS [0.054s]
[INFO] Apache CloudStack Framework - Managed Context ..... SUCCESS [3.836s]
[INFO] Apache CloudStack Utils ........................... SUCCESS [11.253s]
[INFO] Apache CloudStack Framework ....................... SUCCESS [0.032s]
[INFO] Apache CloudStack Framework - Event Notification .. SUCCESS [6.384s]
[INFO] Apache CloudStack Framework - Configuration ....... SUCCESS [5.029s]
[INFO] Apache CloudStack API ............................. SUCCESS [13.515s]
[INFO] Apache CloudStack Framework - REST ................ SUCCESS [3.842s]
[INFO] Apache CloudStack Framework - IPC ................. SUCCESS [7.026s]
[INFO] Apache CloudStack Cloud Engine .................... SUCCESS [0.080s]
[INFO] Apache CloudStack Cloud Engine API ................ SUCCESS [5.477s]
[INFO] Apache CloudStack Core ............................ SUCCESS [9.457s]
[INFO] Apache CloudStack Agents .......................... SUCCESS [6.054s]
[INFO] Apache CloudStack Framework - Clustering .......... SUCCESS [3.636s]
[INFO] Apache CloudStack Framework - Jobs ................ SUCCESS [4.439s]
[INFO] Apache CloudStack Cloud Engine Schema Component ... SUCCESS [11.404s]
[INFO] Apache CloudStack Framework - Event Notification .. SUCCESS [2.049s]
[INFO] Apache CloudStack Cloud Engine Internal Components API  SUCCESS [3.330s]
[INFO] Apache CloudStack Server .......................... SUCCESS [48.989s]
[INFO] Apache CloudStack Usage Server .................... SUCCESS [6.887s]
[INFO] Apache XenSource XAPI ............................. SUCCESS [6.133s]
[INFO] Apache CloudStack Cloud Engine Orchestration Component  SUCCESS [9.592s]
[INFO] Apache CloudStack Cloud Services .................. SUCCESS [0.034s]
[INFO] Apache CloudStack Secondary Storage Service ....... SUCCESS [6.626s]
[INFO] Apache CloudStack Engine Storage Component ........ SUCCESS [7.743s]
[INFO] Apache CloudStack Engine Storage Volume Component . SUCCESS [5.242s]
[INFO] Apache CloudStack Engine Storage Image Component .. SUCCESS [2.807s]
[INFO] Apache CloudStack Engine Storage Data Motion Component  SUCCESS [3.770s]
[INFO] Apache CloudStack Engine Storage Cache Component .. SUCCESS [2.655s]
[INFO] Apache CloudStack Engine Storage Snapshot Component  SUCCESS [8.202s]
[INFO] Apache CloudStack Cloud Engine API ................ SUCCESS [2.616s]
[INFO] Apache CloudStack Cloud Engine Service ............ SUCCESS [0.990s]
[INFO] Apache CloudStack Plugin POM ...................... SUCCESS [0.599s]
[INFO] Apache CloudStack Plugin - API Rate Limit ......... SUCCESS [8.457s]
[INFO] Apache CloudStack Plugin - API Discovery .......... SUCCESS [5.004s]
[INFO] Apache CloudStack Plugin - ACL Static Role Based .. SUCCESS [2.896s]
[INFO] Apache CloudStack Plugin - Host Anti-Affinity Processor  SUCCESS [2.862s]
[INFO] Apache CloudStack Plugin - Explicit Dedication Processor  SUCCESS [2.450s]
[INFO] Apache CloudStack Plugin - User Concentrated Pod Deployment Planner  SUCCESS [2.962s]
[INFO] Apache CloudStack Plugin - User Dispersing Deployment Planner  SUCCESS [2.581s]
[INFO] Apache CloudStack Plugin - Implicit Dedication Planner  SUCCESS [9.052s]
[INFO] Apache CloudStack Plugin - Host Allocator Random .. SUCCESS [2.716s]
[INFO] Apache CloudStack Plugin - Dedicated Resources .... SUCCESS [7.738s]
[INFO] Apache CloudStack Plugin - Hypervisor OracleVM .... SUCCESS [3.566s]
[INFO] Apache CloudStack Plugin - Open vSwitch ........... SUCCESS [4.034s]
[INFO] Apache CloudStack Plugin - Hypervisor Xen ......... FAILURE [10.634s]
[INFO] Apache CloudStack Plugin - Hypervisor KVM ......... SKIPPED
[INFO] Apache CloudStack Plugin - RabbitMQ Event Bus ..... SKIPPED
[INFO] Apache CloudStack Plugin - Hypervisor Baremetal ... SKIPPED
[INFO] Apache CloudStack Plugin - Hypervisor UCS ......... SKIPPED
[INFO] Apache CloudStack Plugin - Hypervisor Hyper-V ..... SKIPPED
[INFO] Apache CloudStack Plugin - Network Elastic Load Balancer  SKIPPED
[INFO] Apache CloudStack Plugin - Network Internal Load Balancer  SKIPPED
[INFO] Apache CloudStack Plugin - Network Juniper Contrail  SKIPPED
[INFO] Apache CloudStack Plugin - Palo Alto .............. SKIPPED
[INFO] Apache CloudStack Checkstyle Configuration ........ SKIPPED
[INFO] Apache CloudStack Plugin - Network Nicira NVP ..... SKIPPED
[INFO] Apache CloudStack Plugin - BigSwitch Virtual Network Segment  SKIPPED
[INFO] Apache CloudStack Plugin - Midokura Midonet ....... SKIPPED
[INFO] Apache Cloudstack Plugin - Stratosphere SSP ....... SKIPPED
[INFO] Apache CloudStack Plugin - Storage Allocator Random  SKIPPED
[INFO] Apache CloudStack Plugin - User Authenticator LDAP  SKIPPED
[INFO] Apache CloudStack Plugin - User Authenticator MD5 . SKIPPED
[INFO] Apache CloudStack Plugin - User Authenticator Plain Text  SKIPPED
[INFO] Apache CloudStack Plugin - User Authenticator SHA256 Salted  SKIPPED
[INFO] Apache CloudStack Plugin - Dns Notifier Example ... SKIPPED
[INFO] Apache CloudStack Plugin - Storage Image S3 ....... SKIPPED
[INFO] Apache CloudStack Plugin - Storage Image Swift provider  SKIPPED
[INFO] Apache CloudStack Plugin - Storage Image default provider  SKIPPED
[INFO] Apache CloudStack Plugin - Storage Image sample provider  SKIPPED
[INFO] Apache CloudStack Plugin - Storage Volume SolidFire Provider  SKIPPED
[INFO] Apache CloudStack Plugin - Storage Volume default provider  SKIPPED
[INFO] Apache CloudStack Plugin - Storage Volume sample provider  SKIPPED
[INFO] Apache CloudStack Plugin - SNMP Alerts ............ SKIPPED
[INFO] Apache CloudStack Plugin - Syslog Alerts .......... SKIPPED
[INFO] Apache CloudStack Plugin - Network VXLAN .......... SKIPPED
[INFO] Apache CloudStack Framework - Spring Life Cycle ... SKIPPED
[INFO] cloud-framework-spring-module ..................... SKIPPED
[INFO] Apache CloudStack Test ............................ SKIPPED
[INFO] Apache CloudStack Client UI ....................... SKIPPED
[INFO] Apache CloudStack Console Proxy ................... SKIPPED
[INFO] Apache CloudStack Console Proxy - Server .......... SKIPPED
[INFO] Apache CloudStack Console Proxy - RDP Client ...... SKIPPED
[INFO] Apache CloudStack Framework - QuickCloud .......... SKIPPED
[INFO] ------------------------------------------------------------------------
[INFO] BUILD FAILURE
[INFO] ------------------------------------------------------------------------
[INFO] Total time: 4:39.899s
[INFO] Finished at: Wed Dec 04 18:00:03 EST 2013
[INFO] Final Memory: 44M/237M
[INFO] ------------------------------------------------------------------------
[ERROR] Failed to execute goal org.apache.maven.plugins:maven-surefire-plugin:2.12:test (default-test)
on project cloud-plugin-hypervisor-xen: There are test failures.
[ERROR] 
[ERROR] Please refer to <http://jenkins.buildacloud.org/job/cloudstack-4.3-maven-build/ws/plugins/hypervisors/xen/target/surefire-reports>
for the individual test results.
[ERROR] -> [Help 1]
[ERROR] 
[ERROR] To see the full stack trace of the errors, re-run Maven with the -e switch.
[ERROR] Re-run Maven using the -X switch to enable full debug logging.
[ERROR] 
[ERROR] For more information about the errors and possible solutions, please read the following
articles:
[ERROR] [Help 1] http://cwiki.apache.org/confluence/display/MAVEN/MojoFailureException
[ERROR] 
[ERROR] After correcting the problems, you can resume the build with the command
[ERROR]   mvn <goals> -rf :cloud-plugin-hypervisor-xen
Build step 'Invoke top-level Maven targets' marked build as failure

Mime
View raw message