cloudstack-dev mailing list archives

Site index · List index
Message view « Date » · « Thread »
Top « Date » · « Thread »
From jenk...@cloudstack.org
Subject Build failed in Jenkins: cloudstack-4.3-maven-build #120
Date Wed, 11 Dec 2013 07:19:44 GMT
See <http://jenkins.buildacloud.org/job/cloudstack-4.3-maven-build/120/changes>

Changes:

[aprateek] CLOUDSTACK-4916: Fixing the issue with DB HA when there are more than 2 db nodes
(Issue was mysql DriverManager was returning salve db nodes on random basis which was causing
issue)

------------------------------------------
[...truncated 929 lines...]
[INFO]                                                                         
[INFO] ------------------------------------------------------------------------
[INFO] Building Apache CloudStack Server 4.3.0-SNAPSHOT
[INFO] ------------------------------------------------------------------------
[INFO] 
[INFO] --- maven-clean-plugin:2.5:clean (default-clean) @ cloud-server ---
[INFO] Deleting <http://jenkins.buildacloud.org/job/cloudstack-4.3-maven-build/ws/server/target>
(includes = [**/*], excludes = [])
[INFO] Deleting <http://jenkins.buildacloud.org/job/cloudstack-4.3-maven-build/ws/server>
(includes = [target, dist], excludes = [])
[INFO] 
[INFO] --- maven-remote-resources-plugin:1.3:process (default) @ cloud-server ---
[INFO] 
[INFO] --- maven-antrun-plugin:1.7:run (generate-resource) @ cloud-server ---
[INFO] Executing tasks

main:
     [copy] Copying 3 files to <http://jenkins.buildacloud.org/job/cloudstack-4.3-maven-build/ws/server/target/conf>
     [copy] Copying 1 file to <http://jenkins.buildacloud.org/job/cloudstack-4.3-maven-build/ws/server/target/conf>
[INFO] Executed tasks
[INFO] 
[INFO] --- maven-resources-plugin:2.5:resources (default-resources) @ cloud-server ---
[debug] execute contextualize
[INFO] Using 'UTF-8' encoding to copy filtered resources.
[INFO] Copying 30 resources
[INFO] Copying 3 resources
[INFO] 
[INFO] --- maven-compiler-plugin:2.5.1:compile (default-compile) @ cloud-server ---
[INFO] Compiling 349 source files to <http://jenkins.buildacloud.org/job/cloudstack-4.3-maven-build/ws/server/target/classes>
[INFO] 
[INFO] --- maven-resources-plugin:2.5:testResources (default-testResources) @ cloud-server
---
[debug] execute contextualize
[INFO] Using 'UTF-8' encoding to copy filtered resources.
[INFO] Copying 29 resources
[INFO] Copying 3 resources
[INFO] 
[INFO] --- maven-compiler-plugin:2.5.1:testCompile (default-testCompile) @ cloud-server ---
[INFO] Compiling 75 source files to <http://jenkins.buildacloud.org/job/cloudstack-4.3-maven-build/ws/server/target/test-classes>
[INFO] 
[INFO] --- maven-surefire-plugin:2.12:test (default-test) @ cloud-server ---
[INFO] Surefire report directory: <http://jenkins.buildacloud.org/job/cloudstack-4.3-maven-build/ws/server/target/surefire-reports>

-------------------------------------------------------
 T E S T S
-------------------------------------------------------
Running org.apache.cloudstack.region.gslb.GlobalLoadBalancingRulesServiceImplTest
log4j:WARN No appenders could be found for logger (org.apache.cloudstack.region.gslb.GlobalLoadBalancingRulesServiceImplTest).
log4j:WARN Please initialize the log4j system properly.
log4j:WARN See http://logging.apache.org/log4j/1.2/faq.html#noconfig for more info.
Tests run: 4, Failures: 0, Errors: 0, Skipped: 0, Time elapsed: 1.1 sec
Running org.apache.cloudstack.region.RegionManagerTest
Tests run: 2, Failures: 0, Errors: 0, Skipped: 0, Time elapsed: 0.034 sec
Running org.apache.cloudstack.service.ServiceOfferingVOTest
Tests run: 2, Failures: 0, Errors: 0, Skipped: 0, Time elapsed: 0.073 sec
Running org.apache.cloudstack.affinity.AffinityApiUnitTest
Tests run: 7, Failures: 0, Errors: 0, Skipped: 0, Time elapsed: 1.794 sec
Running org.apache.cloudstack.privategw.AclOnPrivateGwTest
Tests run: 2, Failures: 0, Errors: 0, Skipped: 0, Time elapsed: 1.155 sec
Running org.apache.cloudstack.network.lb.CertServiceTest
Tests run: 15, Failures: 0, Errors: 0, Skipped: 0, Time elapsed: 1.937 sec
Running org.apache.cloudstack.network.lb.ApplicationLoadBalancerTest
Tests run: 11, Failures: 0, Errors: 0, Skipped: 0, Time elapsed: 0.657 sec
Running org.apache.cloudstack.networkoffering.CreateNetworkOfferingTest
Tests run: 10, Failures: 0, Errors: 0, Skipped: 0, Time elapsed: 8.84 sec
Running com.cloud.keystore.KeystoreTest
org.apache.cloudstack.api.response.UserVmResponse/null/{"id":"3","securitygroup":[],"nic":[],"tags":[],"affinitygroup":[]}
org.apache.cloudstack.api.response.AlertResponse/null/{"id":"100","description":"Hello"}
Tests run: 1, Failures: 0, Errors: 0, Skipped: 0, Time elapsed: 0.266 sec
Running com.cloud.server.ConfigurationServerImplTest
Tests run: 3, Failures: 0, Errors: 0, Skipped: 0, Time elapsed: 0.051 sec
Running com.cloud.event.EventControlsUnitTest
Tests run: 1, Failures: 0, Errors: 0, Skipped: 0, Time elapsed: 0.156 sec
Running com.cloud.resourcelimit.ResourceLimitManagerImplTest
Tests run: 1, Failures: 0, Errors: 0, Skipped: 0, Time elapsed: 0 sec
Running com.cloud.api.ApiDispatcherTest
Tests run: 1, Failures: 0, Errors: 0, Skipped: 0, Time elapsed: 0.06 sec
Running com.cloud.alert.AlertControlsUnitTest
Tests run: 1, Failures: 0, Errors: 0, Skipped: 0, Time elapsed: 0.036 sec
Running com.cloud.ha.KVMFencerTest
Tests run: 6, Failures: 0, Errors: 0, Skipped: 0, Time elapsed: 0.107 sec
Running com.cloud.capacity.CapacityManagerTest
Tests run: 1, Failures: 0, Errors: 0, Skipped: 0, Time elapsed: 0.046 sec
Running com.cloud.vm.snapshot.VMSnapshotManagerTest
Tests run: 7, Failures: 0, Errors: 0, Skipped: 0, Time elapsed: 0.337 sec
Running com.cloud.vm.UserVmManagerTest
Tests run: 9, Failures: 0, Errors: 0, Skipped: 0, Time elapsed: 0.423 sec
Running com.cloud.vm.DeploymentPlanningManagerImplTest
Tests run: 3, Failures: 0, Errors: 0, Skipped: 0, Time elapsed: 0.598 sec
Running com.cloud.network.NetworkModelTest
Tests run: 1, Failures: 0, Errors: 0, Skipped: 0, Time elapsed: 0.032 sec
Running com.cloud.network.security.SecurityGroupManagerImplTest
Tests run: 4, Failures: 0, Errors: 0, Skipped: 0, Time elapsed: 1.402 sec
Running com.cloud.network.security.SecurityGroupQueueTest
Num Vms= 50 Queue size = 50
Num Vms= 20000 Queue size = 20000 time=818 ms
Num Vms= 5000 Queue size = 5000 time=1593 ms
Num Vms= 1 Queue size = 1 time=1 ms
Num Vms= 1000000 Queue size = 1000000 time=810 ms
Num Vms= 1 Queue size = 1 time=223 ms
Total jobs dequeued = 10, num queued=1010 queue current size=1000
Total jobs dequeued = 10, num queued=1008 queue current size=998
Total jobs dequeued = 1, num queued=1001 queue current size=1000
Total jobs dequeued = 10, num queued=1000 queue current size=990
Total jobs dequeued = 10, num queued=10 queue current size=0
Tests run: 4, Failures: 0, Errors: 0, Skipped: 0, Time elapsed: 3.51 sec
Running com.cloud.network.UpdatePhysicalNetworkTest
Tests run: 1, Failures: 0, Errors: 0, Skipped: 0, Time elapsed: 0.019 sec
Running com.cloud.network.DedicateGuestVlanRangesTest
Tests run: 2, Failures: 0, Errors: 0, Skipped: 0, Time elapsed: 0.014 sec
Running com.cloud.network.CreatePrivateNetworkTest
Tests run: 1, Failures: 0, Errors: 0, Skipped: 0, Time elapsed: 0.008 sec
Running com.cloud.network.firewall.FirewallManagerTest
Tests run: 1, Failures: 0, Errors: 0, Skipped: 1, Time elapsed: 0.001 sec
Running com.cloud.network.dao.NetworkDaoTest
Tests run: 2, Failures: 0, Errors: 0, Skipped: 0, Time elapsed: 0 sec
Running com.cloud.vpc.Site2SiteVpnTest
Tests run: 1, Failures: 0, Errors: 0, Skipped: 0, Time elapsed: 2.057 sec
Running com.cloud.vpc.NetworkACLServiceTest
Tests run: 5, Failures: 0, Errors: 5, Skipped: 0, Time elapsed: 0.114 sec <<< FAILURE!
Running com.cloud.vpc.NetworkACLManagerTest
Tests run: 5, Failures: 0, Errors: 5, Skipped: 0, Time elapsed: 0.108 sec <<< FAILURE!
Running com.cloud.configuration.ValidateIpRangeTest
Tests run: 3, Failures: 0, Errors: 0, Skipped: 0, Time elapsed: 0.007 sec
Running com.cloud.configuration.ConfigurationManagerTest
Tests run: 8, Failures: 0, Errors: 0, Skipped: 0, Time elapsed: 0.041 sec

Results :

Tests in error: 
  testCreateACL(com.cloud.vpc.NetworkACLServiceTest): Error creating bean with name 'networkACLServiceImpl':
Injection of autowired dependencies failed; nested exception is org.springframework.beans.factory.BeanCreationException:
Could not autowire field: com.cloud.network.vpc.VpcService com.cloud.network.vpc.NetworkACLServiceImpl._vpcSvc;
nested exception is org.springframework.beans.factory.NoSuchBeanDefinitionException: No qualifying
bean of type [com.cloud.network.vpc.VpcService] found for dependency: expected at least 1
bean which qualifies as autowire candidate for this dependency. Dependency annotations: {@javax.inject.Inject()}
  testDeleteDefaultACL(com.cloud.vpc.NetworkACLServiceTest): Error creating bean with name
'networkACLServiceImpl': Injection of autowired dependencies failed; nested exception is org.springframework.beans.factory.BeanCreationException:
Could not autowire field: com.cloud.network.vpc.VpcService com.cloud.network.vpc.NetworkACLServiceImpl._vpcSvc;
nested exception is org.springframework.beans.factory.NoSuchBeanDefinitionException: No qualifying
bean of type [com.cloud.network.vpc.VpcService] found for dependency: expected at least 1
bean which qualifies as autowire candidate for this dependency. Dependency annotations: {@javax.inject.Inject()}
  testCreateACLItem(com.cloud.vpc.NetworkACLServiceTest): Error creating bean with name 'networkACLServiceImpl':
Injection of autowired dependencies failed; nested exception is org.springframework.beans.factory.BeanCreationException:
Could not autowire field: com.cloud.network.vpc.VpcService com.cloud.network.vpc.NetworkACLServiceImpl._vpcSvc;
nested exception is org.springframework.beans.factory.NoSuchBeanDefinitionException: No qualifying
bean of type [com.cloud.network.vpc.VpcService] found for dependency: expected at least 1
bean which qualifies as autowire candidate for this dependency. Dependency annotations: {@javax.inject.Inject()}
  testCreateACLItemDuplicateNumber(com.cloud.vpc.NetworkACLServiceTest): Error creating bean
with name 'networkACLServiceImpl': Injection of autowired dependencies failed; nested exception
is org.springframework.beans.factory.BeanCreationException: Could not autowire field: com.cloud.network.vpc.VpcService
com.cloud.network.vpc.NetworkACLServiceImpl._vpcSvc; nested exception is org.springframework.beans.factory.NoSuchBeanDefinitionException:
No qualifying bean of type [com.cloud.network.vpc.VpcService] found for dependency: expected
at least 1 bean which qualifies as autowire candidate for this dependency. Dependency annotations:
{@javax.inject.Inject()}
  testDeleteACLItem(com.cloud.vpc.NetworkACLServiceTest): Error creating bean with name 'networkACLServiceImpl':
Injection of autowired dependencies failed; nested exception is org.springframework.beans.factory.BeanCreationException:
Could not autowire field: com.cloud.network.vpc.VpcService com.cloud.network.vpc.NetworkACLServiceImpl._vpcSvc;
nested exception is org.springframework.beans.factory.NoSuchBeanDefinitionException: No qualifying
bean of type [com.cloud.network.vpc.VpcService] found for dependency: expected at least 1
bean which qualifies as autowire candidate for this dependency. Dependency annotations: {@javax.inject.Inject()}
  testCreateACL(com.cloud.vpc.NetworkACLManagerTest): Error creating bean with name 'networkACLManagerImpl':
Injection of autowired dependencies failed; nested exception is org.springframework.beans.factory.BeanCreationException:
Could not autowire field: com.cloud.network.vpc.VpcService com.cloud.network.vpc.NetworkACLManagerImpl._vpcSvc;
nested exception is org.springframework.beans.factory.NoSuchBeanDefinitionException: No qualifying
bean of type [com.cloud.network.vpc.VpcService] found for dependency: expected at least 1
bean which qualifies as autowire candidate for this dependency. Dependency annotations: {@javax.inject.Inject()}
  testApplyACL(com.cloud.vpc.NetworkACLManagerTest): Error creating bean with name 'networkACLManagerImpl':
Injection of autowired dependencies failed; nested exception is org.springframework.beans.factory.BeanCreationException:
Could not autowire field: com.cloud.network.vpc.VpcService com.cloud.network.vpc.NetworkACLManagerImpl._vpcSvc;
nested exception is org.springframework.beans.factory.NoSuchBeanDefinitionException: No qualifying
bean of type [com.cloud.network.vpc.VpcService] found for dependency: expected at least 1
bean which qualifies as autowire candidate for this dependency. Dependency annotations: {@javax.inject.Inject()}
  testRevokeACLItem(com.cloud.vpc.NetworkACLManagerTest): Error creating bean with name 'networkACLManagerImpl':
Injection of autowired dependencies failed; nested exception is org.springframework.beans.factory.BeanCreationException:
Could not autowire field: com.cloud.network.vpc.VpcService com.cloud.network.vpc.NetworkACLManagerImpl._vpcSvc;
nested exception is org.springframework.beans.factory.NoSuchBeanDefinitionException: No qualifying
bean of type [com.cloud.network.vpc.VpcService] found for dependency: expected at least 1
bean which qualifies as autowire candidate for this dependency. Dependency annotations: {@javax.inject.Inject()}
  testUpdateACLItem(com.cloud.vpc.NetworkACLManagerTest): Error creating bean with name 'networkACLManagerImpl':
Injection of autowired dependencies failed; nested exception is org.springframework.beans.factory.BeanCreationException:
Could not autowire field: com.cloud.network.vpc.VpcService com.cloud.network.vpc.NetworkACLManagerImpl._vpcSvc;
nested exception is org.springframework.beans.factory.NoSuchBeanDefinitionException: No qualifying
bean of type [com.cloud.network.vpc.VpcService] found for dependency: expected at least 1
bean which qualifies as autowire candidate for this dependency. Dependency annotations: {@javax.inject.Inject()}
  deleteNonEmptyACL(com.cloud.vpc.NetworkACLManagerTest): Error creating bean with name 'networkACLManagerImpl':
Injection of autowired dependencies failed; nested exception is org.springframework.beans.factory.BeanCreationException:
Could not autowire field: com.cloud.network.vpc.VpcService com.cloud.network.vpc.NetworkACLManagerImpl._vpcSvc;
nested exception is org.springframework.beans.factory.NoSuchBeanDefinitionException: No qualifying
bean of type [com.cloud.network.vpc.VpcService] found for dependency: expected at least 1
bean which qualifies as autowire candidate for this dependency. Dependency annotations: {@javax.inject.Inject()}

Tests run: 125, Failures: 0, Errors: 10, Skipped: 1

[INFO] ------------------------------------------------------------------------
[INFO] Reactor Summary:
[INFO] 
[INFO] Apache CloudStack ................................. SUCCESS [1.536s]
[INFO] Apache CloudStack Maven Conventions Parent ........ SUCCESS [0.051s]
[INFO] Apache CloudStack Framework - Managed Context ..... SUCCESS [4.188s]
[INFO] Apache CloudStack Utils ........................... SUCCESS [11.257s]
[INFO] Apache CloudStack Framework ....................... SUCCESS [0.033s]
[INFO] Apache CloudStack Framework - Event Notification .. SUCCESS [6.411s]
[INFO] Apache CloudStack Framework - Configuration ....... SUCCESS [4.895s]
[INFO] Apache CloudStack API ............................. SUCCESS [14.860s]
[INFO] Apache CloudStack Framework - REST ................ SUCCESS [3.492s]
[INFO] Apache CloudStack Framework - IPC ................. SUCCESS [6.650s]
[INFO] Apache CloudStack Cloud Engine .................... SUCCESS [0.039s]
[INFO] Apache CloudStack Cloud Engine API ................ SUCCESS [5.348s]
[INFO] Apache CloudStack Core ............................ SUCCESS [9.451s]
[INFO] Apache CloudStack Agents .......................... SUCCESS [5.685s]
[INFO] Apache CloudStack Framework - Clustering .......... SUCCESS [3.606s]
[INFO] Apache CloudStack Framework - Jobs ................ SUCCESS [4.288s]
[INFO] Apache CloudStack Cloud Engine Schema Component ... SUCCESS [11.276s]
[INFO] Apache CloudStack Framework - Event Notification .. SUCCESS [2.686s]
[INFO] Apache CloudStack Cloud Engine Internal Components API  SUCCESS [3.024s]
[INFO] Apache CloudStack Server .......................... FAILURE [49.119s]
[INFO] Apache CloudStack Usage Server .................... SKIPPED
[INFO] Apache XenSource XAPI ............................. SKIPPED
[INFO] Apache CloudStack Cloud Engine Orchestration Component  SKIPPED
[INFO] Apache CloudStack Cloud Services .................. SKIPPED
[INFO] Apache CloudStack Secondary Storage Service ....... SKIPPED
[INFO] Apache CloudStack Engine Storage Component ........ SKIPPED
[INFO] Apache CloudStack Engine Storage Volume Component . SKIPPED
[INFO] Apache CloudStack Engine Storage Image Component .. SKIPPED
[INFO] Apache CloudStack Engine Storage Data Motion Component  SKIPPED
[INFO] Apache CloudStack Engine Storage Cache Component .. SKIPPED
[INFO] Apache CloudStack Engine Storage Snapshot Component  SKIPPED
[INFO] Apache CloudStack Cloud Engine API ................ SKIPPED
[INFO] Apache CloudStack Cloud Engine Service ............ SKIPPED
[INFO] Apache CloudStack Plugin POM ...................... SKIPPED
[INFO] Apache CloudStack Plugin - API Rate Limit ......... SKIPPED
[INFO] Apache CloudStack Plugin - API Discovery .......... SKIPPED
[INFO] Apache CloudStack Plugin - ACL Static Role Based .. SKIPPED
[INFO] Apache CloudStack Plugin - Host Anti-Affinity Processor  SKIPPED
[INFO] Apache CloudStack Plugin - Explicit Dedication Processor  SKIPPED
[INFO] Apache CloudStack Plugin - User Concentrated Pod Deployment Planner  SKIPPED
[INFO] Apache CloudStack Plugin - User Dispersing Deployment Planner  SKIPPED
[INFO] Apache CloudStack Plugin - Implicit Dedication Planner  SKIPPED
[INFO] Apache CloudStack Plugin - Host Allocator Random .. SKIPPED
[INFO] Apache CloudStack Plugin - Dedicated Resources .... SKIPPED
[INFO] Apache CloudStack Plugin - Hypervisor OracleVM .... SKIPPED
[INFO] Apache CloudStack Plugin - Open vSwitch ........... SKIPPED
[INFO] Apache CloudStack Plugin - Hypervisor Xen ......... SKIPPED
[INFO] Apache CloudStack Plugin - Hypervisor KVM ......... SKIPPED
[INFO] Apache CloudStack Plugin - RabbitMQ Event Bus ..... SKIPPED
[INFO] Apache CloudStack Plugin - Hypervisor Baremetal ... SKIPPED
[INFO] Apache CloudStack Plugin - Hypervisor UCS ......... SKIPPED
[INFO] Apache CloudStack Plugin - Hypervisor Hyper-V ..... SKIPPED
[INFO] Apache CloudStack Plugin - Network Elastic Load Balancer  SKIPPED
[INFO] Apache CloudStack Plugin - Network Internal Load Balancer  SKIPPED
[INFO] Apache CloudStack Plugin - Network Juniper Contrail  SKIPPED
[INFO] Apache CloudStack Plugin - Palo Alto .............. SKIPPED
[INFO] Apache CloudStack Checkstyle Configuration ........ SKIPPED
[INFO] Apache CloudStack Plugin - Network Nicira NVP ..... SKIPPED
[INFO] Apache CloudStack Plugin - BigSwitch Virtual Network Segment  SKIPPED
[INFO] Apache CloudStack Plugin - Midokura Midonet ....... SKIPPED
[INFO] Apache Cloudstack Plugin - Stratosphere SSP ....... SKIPPED
[INFO] Apache CloudStack Plugin - Storage Allocator Random  SKIPPED
[INFO] Apache CloudStack Plugin - User Authenticator LDAP  SKIPPED
[INFO] Apache CloudStack Plugin - User Authenticator MD5 . SKIPPED
[INFO] Apache CloudStack Plugin - User Authenticator Plain Text  SKIPPED
[INFO] Apache CloudStack Plugin - User Authenticator SHA256 Salted  SKIPPED
[INFO] Apache CloudStack Plugin - Dns Notifier Example ... SKIPPED
[INFO] Apache CloudStack Plugin - Storage Image S3 ....... SKIPPED
[INFO] Apache CloudStack Plugin - Storage Image Swift provider  SKIPPED
[INFO] Apache CloudStack Plugin - Storage Image default provider  SKIPPED
[INFO] Apache CloudStack Plugin - Storage Image sample provider  SKIPPED
[INFO] Apache CloudStack Plugin - Storage Volume SolidFire Provider  SKIPPED
[INFO] Apache CloudStack Plugin - Storage Volume default provider  SKIPPED
[INFO] Apache CloudStack Plugin - Storage Volume sample provider  SKIPPED
[INFO] Apache CloudStack Plugin - SNMP Alerts ............ SKIPPED
[INFO] Apache CloudStack Plugin - Syslog Alerts .......... SKIPPED
[INFO] Apache CloudStack Plugin - Network VXLAN .......... SKIPPED
[INFO] Apache CloudStack Framework - Spring Life Cycle ... SKIPPED
[INFO] cloud-framework-spring-module ..................... SKIPPED
[INFO] Apache CloudStack Test ............................ SKIPPED
[INFO] Apache CloudStack Client UI ....................... SKIPPED
[INFO] Apache CloudStack Console Proxy ................... SKIPPED
[INFO] Apache CloudStack Console Proxy - Server .......... SKIPPED
[INFO] Apache CloudStack Console Proxy - RDP Client ...... SKIPPED
[INFO] Apache CloudStack Framework - QuickCloud .......... SKIPPED
[INFO] ------------------------------------------------------------------------
[INFO] BUILD FAILURE
[INFO] ------------------------------------------------------------------------
[INFO] Total time: 2:31.165s
[INFO] Finished at: Wed Dec 11 02:17:31 EST 2013
[INFO] Final Memory: 37M/182M
[INFO] ------------------------------------------------------------------------
[ERROR] Failed to execute goal org.apache.maven.plugins:maven-surefire-plugin:2.12:test (default-test)
on project cloud-server: There are test failures.
[ERROR] 
[ERROR] Please refer to <http://jenkins.buildacloud.org/job/cloudstack-4.3-maven-build/ws/server/target/surefire-reports>
for the individual test results.
[ERROR] -> [Help 1]
[ERROR] 
[ERROR] To see the full stack trace of the errors, re-run Maven with the -e switch.
[ERROR] Re-run Maven using the -X switch to enable full debug logging.
[ERROR] 
[ERROR] For more information about the errors and possible solutions, please read the following
articles:
[ERROR] [Help 1] http://cwiki.apache.org/confluence/display/MAVEN/MojoFailureException
[ERROR] 
[ERROR] After correcting the problems, you can resume the build with the command
[ERROR]   mvn <goals> -rf :cloud-server
Build step 'Invoke top-level Maven targets' marked build as failure

Mime
View raw message