cloudstack-dev mailing list archives

Site index · List index
Message view « Date » · « Thread »
Top « Date » · « Thread »
From jenk...@cloudstack.org
Subject Build failed in Jenkins: build-master-noredist #1801
Date Fri, 15 Nov 2013 00:12:58 GMT
See <http://jenkins.buildacloud.org/job/build-master-noredist/1801/changes>

Changes:

[sheng.yang] Make com.cloud.network.vpn.RemoteAccessVpnService an extensible type

[nitin.mehta] CLOUDSTACK-5176:

[sudison] Add a new method on datastoredriver: getCapabilities, which will be called by liststoragepoolcmd.
UI can make decision based on the capabilities of the storage.

------------------------------------------
[...truncated 1171 lines...]
[INFO] 
[INFO] --- maven-install-plugin:2.3.1:install (default-install) @ cloud-engine-schema ---
[INFO] Installing <http://jenkins.buildacloud.org/job/build-master-noredist/ws/engine/schema/target/cloud-engine-schema-4.3.0-SNAPSHOT.jar>
to /jenkins/.m2/repository/org/apache/cloudstack/cloud-engine-schema/4.3.0-SNAPSHOT/cloud-engine-schema-4.3.0-SNAPSHOT.jar
[INFO] Installing <http://jenkins.buildacloud.org/job/build-master-noredist/ws/engine/schema/pom.xml>
to /jenkins/.m2/repository/org/apache/cloudstack/cloud-engine-schema/4.3.0-SNAPSHOT/cloud-engine-schema-4.3.0-SNAPSHOT.pom
[INFO]                                                                         
[INFO] ------------------------------------------------------------------------
[INFO] Building Apache CloudStack Framework - Event Notification 4.3.0-SNAPSHOT
[INFO] ------------------------------------------------------------------------
[INFO] 
[INFO] --- maven-clean-plugin:2.5:clean (default-clean) @ cloud-framework-events ---
[INFO] Deleting <http://jenkins.buildacloud.org/job/build-master-noredist/ws/framework/events/target>
(includes = [**/*], excludes = [])
[INFO] Deleting <http://jenkins.buildacloud.org/job/build-master-noredist/ws/framework/events>
(includes = [target, dist], excludes = [])
[INFO] 
[INFO] --- maven-remote-resources-plugin:1.3:process (default) @ cloud-framework-events ---
[INFO] 
[INFO] --- maven-resources-plugin:2.5:resources (default-resources) @ cloud-framework-events
---
[debug] execute contextualize
[INFO] Using 'UTF-8' encoding to copy filtered resources.
[INFO] skip non existing resourceDirectory <http://jenkins.buildacloud.org/job/build-master-noredist/ws/framework/events/resources>
[INFO] Copying 3 resources
[INFO] 
[INFO] --- maven-compiler-plugin:2.5.1:compile (default-compile) @ cloud-framework-events
---
[INFO] Compiling 5 source files to <http://jenkins.buildacloud.org/job/build-master-noredist/ws/framework/events/target/classes>
[INFO] 
[INFO] --- maven-resources-plugin:2.5:testResources (default-testResources) @ cloud-framework-events
---
[debug] execute contextualize
[INFO] Using 'UTF-8' encoding to copy filtered resources.
[INFO] skip non existing resourceDirectory <http://jenkins.buildacloud.org/job/build-master-noredist/ws/framework/events/test/resources>
[INFO] Copying 3 resources
[INFO] 
[INFO] --- maven-compiler-plugin:2.5.1:testCompile (default-testCompile) @ cloud-framework-events
---
[INFO] No sources to compile
[INFO] 
[INFO] --- maven-surefire-plugin:2.12:test (default-test) @ cloud-framework-events ---
[INFO] Surefire report directory: <http://jenkins.buildacloud.org/job/build-master-noredist/ws/framework/events/target/surefire-reports>

-------------------------------------------------------
 T E S T S
-------------------------------------------------------

Results :

Tests run: 0, Failures: 0, Errors: 0, Skipped: 0

[INFO] 
[INFO] --- maven-jar-plugin:2.4:jar (default-jar) @ cloud-framework-events ---
[INFO] Building jar: <http://jenkins.buildacloud.org/job/build-master-noredist/ws/framework/events/target/cloud-framework-events-4.3.0-SNAPSHOT.jar>
[INFO] 
[INFO] --- maven-site-plugin:3.1:attach-descriptor (attach-descriptor) @ cloud-framework-events
---
[INFO] 
[INFO] --- maven-install-plugin:2.3.1:install (default-install) @ cloud-framework-events ---
[INFO] Installing <http://jenkins.buildacloud.org/job/build-master-noredist/ws/framework/events/target/cloud-framework-events-4.3.0-SNAPSHOT.jar>
to /jenkins/.m2/repository/org/apache/cloudstack/cloud-framework-events/4.3.0-SNAPSHOT/cloud-framework-events-4.3.0-SNAPSHOT.jar
[INFO] Installing <http://jenkins.buildacloud.org/job/build-master-noredist/ws/framework/events/pom.xml>
to /jenkins/.m2/repository/org/apache/cloudstack/cloud-framework-events/4.3.0-SNAPSHOT/cloud-framework-events-4.3.0-SNAPSHOT.pom
[INFO]                                                                         
[INFO] ------------------------------------------------------------------------
[INFO] Building Apache CloudStack Cloud Engine Internal Components API 4.3.0-SNAPSHOT
[INFO] ------------------------------------------------------------------------
[INFO] 
[INFO] --- maven-clean-plugin:2.5:clean (default-clean) @ cloud-engine-components-api ---
[INFO] Deleting <http://jenkins.buildacloud.org/job/build-master-noredist/ws/engine/components-api/target>
(includes = [**/*], excludes = [])
[INFO] Deleting <http://jenkins.buildacloud.org/job/build-master-noredist/ws/engine/components-api>
(includes = [target, dist], excludes = [])
[INFO] 
[INFO] --- maven-remote-resources-plugin:1.3:process (default) @ cloud-engine-components-api
---
[INFO] 
[INFO] --- maven-resources-plugin:2.5:resources (default-resources) @ cloud-engine-components-api
---
[debug] execute contextualize
[INFO] Using 'UTF-8' encoding to copy filtered resources.
[INFO] Copying 1 resource
[INFO] Copying 3 resources
[INFO] 
[INFO] --- maven-compiler-plugin:2.5.1:compile (default-compile) @ cloud-engine-components-api
---
[INFO] Compiling 26 source files to <http://jenkins.buildacloud.org/job/build-master-noredist/ws/engine/components-api/target/classes>
[INFO] 
[INFO] --- maven-resources-plugin:2.5:testResources (default-testResources) @ cloud-engine-components-api
---
[debug] execute contextualize
[INFO] Using 'UTF-8' encoding to copy filtered resources.
[INFO] skip non existing resourceDirectory <http://jenkins.buildacloud.org/job/build-master-noredist/ws/engine/components-api/test/resources>
[INFO] Copying 3 resources
[INFO] 
[INFO] --- maven-compiler-plugin:2.5.1:testCompile (default-testCompile) @ cloud-engine-components-api
---
[INFO] No sources to compile
[INFO] 
[INFO] --- maven-surefire-plugin:2.12:test (default-test) @ cloud-engine-components-api ---
[INFO] Surefire report directory: <http://jenkins.buildacloud.org/job/build-master-noredist/ws/engine/components-api/target/surefire-reports>

-------------------------------------------------------
 T E S T S
-------------------------------------------------------

Results :

Tests run: 0, Failures: 0, Errors: 0, Skipped: 0

[INFO] 
[INFO] --- maven-jar-plugin:2.4:jar (default-jar) @ cloud-engine-components-api ---
[INFO] Building jar: <http://jenkins.buildacloud.org/job/build-master-noredist/ws/engine/components-api/target/cloud-engine-components-api-4.3.0-SNAPSHOT.jar>
[INFO] 
[INFO] --- maven-site-plugin:3.1:attach-descriptor (attach-descriptor) @ cloud-engine-components-api
---
[INFO] 
[INFO] --- maven-install-plugin:2.3.1:install (default-install) @ cloud-engine-components-api
---
[INFO] Installing <http://jenkins.buildacloud.org/job/build-master-noredist/ws/engine/components-api/target/cloud-engine-components-api-4.3.0-SNAPSHOT.jar>
to /jenkins/.m2/repository/org/apache/cloudstack/cloud-engine-components-api/4.3.0-SNAPSHOT/cloud-engine-components-api-4.3.0-SNAPSHOT.jar
[INFO] Installing <http://jenkins.buildacloud.org/job/build-master-noredist/ws/engine/components-api/pom.xml>
to /jenkins/.m2/repository/org/apache/cloudstack/cloud-engine-components-api/4.3.0-SNAPSHOT/cloud-engine-components-api-4.3.0-SNAPSHOT.pom
[INFO]                                                                         
[INFO] ------------------------------------------------------------------------
[INFO] Building Apache CloudStack Server 4.3.0-SNAPSHOT
[INFO] ------------------------------------------------------------------------
[INFO] 
[INFO] --- maven-clean-plugin:2.5:clean (default-clean) @ cloud-server ---
[INFO] Deleting <http://jenkins.buildacloud.org/job/build-master-noredist/ws/server/target>
(includes = [**/*], excludes = [])
[INFO] Deleting <http://jenkins.buildacloud.org/job/build-master-noredist/ws/server>
(includes = [target, dist], excludes = [])
[INFO] 
[INFO] --- maven-remote-resources-plugin:1.3:process (default) @ cloud-server ---
[INFO] 
[INFO] --- maven-antrun-plugin:1.7:run (generate-resource) @ cloud-server ---
[INFO] Executing tasks

main:
     [copy] Copying 3 files to <http://jenkins.buildacloud.org/job/build-master-noredist/ws/server/target/conf>
     [copy] Copying 1 file to <http://jenkins.buildacloud.org/job/build-master-noredist/ws/server/target/conf>
[INFO] Executed tasks
[INFO] 
[INFO] --- maven-resources-plugin:2.5:resources (default-resources) @ cloud-server ---
[debug] execute contextualize
[INFO] Using 'UTF-8' encoding to copy filtered resources.
[INFO] Copying 30 resources
[INFO] Copying 3 resources
[INFO] 
[INFO] --- maven-compiler-plugin:2.5.1:compile (default-compile) @ cloud-server ---
[INFO] Compiling 349 source files to <http://jenkins.buildacloud.org/job/build-master-noredist/ws/server/target/classes>
[INFO] -------------------------------------------------------------
[ERROR] COMPILATION ERROR : 
[INFO] -------------------------------------------------------------
[ERROR] <http://jenkins.buildacloud.org/job/build-master-noredist/ws/server/src/com/cloud/configuration/Config.java>:[261,214]
package ConfigurationParameterScope does not exist
[ERROR] <http://jenkins.buildacloud.org/job/build-master-noredist/ws/server/src/com/cloud/configuration/Config.java>:[262,220]
package ConfigurationParameterScope does not exist
[INFO] 2 errors 
[INFO] -------------------------------------------------------------
[INFO] ------------------------------------------------------------------------
[INFO] Reactor Summary:
[INFO] 
[INFO] Apache CloudStack ................................. SUCCESS [4.607s]
[INFO] Apache CloudStack Maven Conventions Parent ........ SUCCESS [0.100s]
[INFO] Apache CloudStack Framework - Managed Context ..... SUCCESS [6.496s]
[INFO] Apache CloudStack Utils ........................... SUCCESS [15.136s]
[INFO] Apache CloudStack Framework ....................... SUCCESS [0.033s]
[INFO] Apache CloudStack Framework - Event Notification .. SUCCESS [9.999s]
[INFO] Apache CloudStack Framework - Configuration ....... SUCCESS [6.113s]
[INFO] Apache CloudStack API ............................. SUCCESS [19.714s]
[INFO] Apache CloudStack Framework - REST ................ SUCCESS [4.830s]
[INFO] Apache CloudStack Framework - IPC ................. SUCCESS [8.757s]
[INFO] Apache CloudStack Cloud Engine .................... SUCCESS [0.031s]
[INFO] Apache CloudStack Cloud Engine API ................ SUCCESS [6.170s]
[INFO] Apache CloudStack Core ............................ SUCCESS [11.890s]
[INFO] Apache CloudStack Agents .......................... SUCCESS [8.715s]
[INFO] Apache CloudStack Framework - Clustering .......... SUCCESS [4.878s]
[INFO] Apache CloudStack Framework - Jobs ................ SUCCESS [5.443s]
[INFO] Apache CloudStack Cloud Engine Schema Component ... SUCCESS [16.412s]
[INFO] Apache CloudStack Framework - Event Notification .. SUCCESS [3.198s]
[INFO] Apache CloudStack Cloud Engine Internal Components API  SUCCESS [4.616s]
[INFO] Apache CloudStack Server .......................... FAILURE [21.349s]
[INFO] Apache CloudStack Usage Server .................... SKIPPED
[INFO] Apache XenSource XAPI ............................. SKIPPED
[INFO] Apache CloudStack Cloud Engine Orchestration Component  SKIPPED
[INFO] Apache CloudStack Cloud Services .................. SKIPPED
[INFO] Apache CloudStack Secondary Storage Service ....... SKIPPED
[INFO] Apache CloudStack Engine Storage Component ........ SKIPPED
[INFO] Apache CloudStack Engine Storage Volume Component . SKIPPED
[INFO] Apache CloudStack Engine Storage Image Component .. SKIPPED
[INFO] Apache CloudStack Engine Storage Data Motion Component  SKIPPED
[INFO] Apache CloudStack Engine Storage Cache Component .. SKIPPED
[INFO] Apache CloudStack Engine Storage Snapshot Component  SKIPPED
[INFO] Apache CloudStack Cloud Engine API ................ SKIPPED
[INFO] Apache CloudStack Cloud Engine Service ............ SKIPPED
[INFO] Apache CloudStack Plugin POM ...................... SKIPPED
[INFO] Apache CloudStack Plugin - API Rate Limit ......... SKIPPED
[INFO] Apache CloudStack Plugin - API Discovery .......... SKIPPED
[INFO] Apache CloudStack Plugin - ACL Static Role Based .. SKIPPED
[INFO] Apache CloudStack Plugin - Host Anti-Affinity Processor  SKIPPED
[INFO] Apache CloudStack Plugin - Explicit Dedication Processor  SKIPPED
[INFO] Apache CloudStack Plugin - User Concentrated Pod Deployment Planner  SKIPPED
[INFO] Apache CloudStack Plugin - User Dispersing Deployment Planner  SKIPPED
[INFO] Apache CloudStack Plugin - Implicit Dedication Planner  SKIPPED
[INFO] Apache CloudStack Plugin - Host Allocator Random .. SKIPPED
[INFO] Apache CloudStack Plugin - Dedicated Resources .... SKIPPED
[INFO] Apache CloudStack Plugin - Hypervisor OracleVM .... SKIPPED
[INFO] Apache CloudStack Plugin - Open vSwitch ........... SKIPPED
[INFO] Apache CloudStack Plugin - Hypervisor Xen ......... SKIPPED
[INFO] Apache CloudStack Plugin - Hypervisor KVM ......... SKIPPED
[INFO] Apache CloudStack Plugin - RabbitMQ Event Bus ..... SKIPPED
[INFO] Apache CloudStack Plugin - Hypervisor Baremetal ... SKIPPED
[INFO] Apache CloudStack Plugin - Hypervisor UCS ......... SKIPPED
[INFO] Apache CloudStack Plugin - Hypervisor Hyper-V ..... SKIPPED
[INFO] Apache CloudStack Plugin - Network Elastic Load Balancer  SKIPPED
[INFO] Apache CloudStack Plugin - Network Internal Load Balancer  SKIPPED
[INFO] Apache CloudStack Plugin - Network Juniper Contrail  SKIPPED
[INFO] Apache CloudStack Plugin - Palo Alto .............. SKIPPED
[INFO] Apache CloudStack Checkstyle Configuration ........ SKIPPED
[INFO] Apache CloudStack Plugin - Network Nicira NVP ..... SKIPPED
[INFO] Apache CloudStack Plugin - BigSwitch Virtual Network Segment  SKIPPED
[INFO] Apache CloudStack Plugin - Midokura Midonet ....... SKIPPED
[INFO] Apache Cloudstack Plugin - Stratosphere SSP ....... SKIPPED
[INFO] Apache CloudStack Plugin - Storage Allocator Random  SKIPPED
[INFO] Apache CloudStack Plugin - User Authenticator LDAP  SKIPPED
[INFO] Apache CloudStack Plugin - User Authenticator MD5 . SKIPPED
[INFO] Apache CloudStack Plugin - User Authenticator Plain Text  SKIPPED
[INFO] Apache CloudStack Plugin - User Authenticator SHA256 Salted  SKIPPED
[INFO] Apache CloudStack Plugin - Dns Notifier Example ... SKIPPED
[INFO] Apache CloudStack Plugin - Storage Image S3 ....... SKIPPED
[INFO] Apache CloudStack Plugin - Storage Image Swift provider  SKIPPED
[INFO] Apache CloudStack Plugin - Storage Image default provider  SKIPPED
[INFO] Apache CloudStack Plugin - Storage Image sample provider  SKIPPED
[INFO] Apache CloudStack Plugin - Storage Volume SolidFire Provider  SKIPPED
[INFO] Apache CloudStack Plugin - Storage Volume default provider  SKIPPED
[INFO] Apache CloudStack Plugin - Storage Volume sample provider  SKIPPED
[INFO] Apache CloudStack Plugin - SNMP Alerts ............ SKIPPED
[INFO] Apache CloudStack Plugin - Syslog Alerts .......... SKIPPED
[INFO] Apache CloudStack Plugin - Network VXLAN .......... SKIPPED
[INFO] Apache CloudStack Framework - Spring Life Cycle ... SKIPPED
[INFO] cloud-framework-spring-module ..................... SKIPPED
[INFO] Apache CloudStack Test ............................ SKIPPED
[INFO] Apache CloudStack Console Proxy ................... SKIPPED
[INFO] Apache CloudStack Console Proxy - Server .......... SKIPPED
[INFO] Apache CloudStack System VM ....................... SKIPPED
[INFO] Apache CloudStack Client UI ....................... SKIPPED
[INFO] Apache CloudStack Console Proxy - RDP Client ...... SKIPPED
[INFO] Apache CloudStack Framework - QuickCloud .......... SKIPPED
[INFO] Apache CloudStack AWS API Bridge .................. SKIPPED
[INFO] ------------------------------------------------------------------------
[INFO] BUILD FAILURE
[INFO] ------------------------------------------------------------------------
[INFO] Total time: 2:43.825s
[INFO] Finished at: Fri Nov 15 01:18:25 CET 2013
[INFO] Final Memory: 35M/97M
[INFO] ------------------------------------------------------------------------
[ERROR] Failed to execute goal org.apache.maven.plugins:maven-compiler-plugin:2.5.1:compile
(default-compile) on project cloud-server: Compilation failure: Compilation failure:
[ERROR] <http://jenkins.buildacloud.org/job/build-master-noredist/ws/server/src/com/cloud/configuration/Config.java>:[261,214]
package ConfigurationParameterScope does not exist
[ERROR] <http://jenkins.buildacloud.org/job/build-master-noredist/ws/server/src/com/cloud/configuration/Config.java>:[262,220]
package ConfigurationParameterScope does not exist
[ERROR] -> [Help 1]
[ERROR] 
[ERROR] To see the full stack trace of the errors, re-run Maven with the -e switch.
[ERROR] Re-run Maven using the -X switch to enable full debug logging.
[ERROR] 
[ERROR] For more information about the errors and possible solutions, please read the following
articles:
[ERROR] [Help 1] http://cwiki.apache.org/confluence/display/MAVEN/MojoFailureException
[ERROR] 
[ERROR] After correcting the problems, you can resume the build with the command
[ERROR]   mvn <goals> -rf :cloud-server
Build step 'Invoke top-level Maven targets' marked build as failure
Archiving artifacts
Skipping Cobertura coverage report as build was not SUCCESS or better ...

Mime
View raw message