cloudstack-dev mailing list archives

Site index · List index
Message view « Date » · « Thread »
Top « Date » · « Thread »
From jenk...@cloudstack.org
Subject Build failed in Jenkins: build-master-noredist #1648
Date Wed, 30 Oct 2013 23:26:01 GMT
See <http://jenkins.buildacloud.org/job/build-master-noredist/1648/changes>

Changes:

[anthony.xu] CLOUDSTACK-4750

------------------------------------------
[...truncated 4049 lines...]
[INFO] --- maven-remote-resources-plugin:1.3:process (default) @ cloud-plugin-syslog-alerts
---
[INFO] 
[INFO] --- maven-resources-plugin:2.5:resources (default-resources) @ cloud-plugin-syslog-alerts
---
[debug] execute contextualize
[INFO] Using 'UTF-8' encoding to copy filtered resources.
[INFO] skip non existing resourceDirectory <http://jenkins.buildacloud.org/job/build-master-noredist/ws/plugins/alert-handlers/syslog-alerts/resources>
[INFO] Copying 3 resources
[INFO] 
[INFO] --- maven-compiler-plugin:2.5.1:compile (default-compile) @ cloud-plugin-syslog-alerts
---
[INFO] Compiling 1 source file to <http://jenkins.buildacloud.org/job/build-master-noredist/ws/plugins/alert-handlers/syslog-alerts/target/classes>
[INFO] 
[INFO] --- maven-resources-plugin:2.5:testResources (default-testResources) @ cloud-plugin-syslog-alerts
---
[debug] execute contextualize
[INFO] Using 'UTF-8' encoding to copy filtered resources.
[INFO] skip non existing resourceDirectory <http://jenkins.buildacloud.org/job/build-master-noredist/ws/plugins/alert-handlers/syslog-alerts/test/resources>
[INFO] Copying 3 resources
[INFO] 
[INFO] --- maven-compiler-plugin:2.5.1:testCompile (default-testCompile) @ cloud-plugin-syslog-alerts
---
[INFO] Compiling 1 source file to <http://jenkins.buildacloud.org/job/build-master-noredist/ws/plugins/alert-handlers/syslog-alerts/target/test-classes>
[INFO] 
[INFO] --- maven-surefire-plugin:2.12:test (default-test) @ cloud-plugin-syslog-alerts ---
[INFO] Surefire report directory: <http://jenkins.buildacloud.org/job/build-master-noredist/ws/plugins/alert-handlers/syslog-alerts/target/surefire-reports>

-------------------------------------------------------
 T E S T S
-------------------------------------------------------
Running org.apache.cloudstack.syslog.AlertsSyslogAppenderTest
log4j:ERROR  Invalid format for the IP Addresses parameter 
Tests run: 3, Failures: 0, Errors: 0, Skipped: 0, Time elapsed: 0.706 sec

Results :

Tests run: 3, Failures: 0, Errors: 0, Skipped: 0

[INFO] 
[INFO] --- maven-jar-plugin:2.4:jar (default-jar) @ cloud-plugin-syslog-alerts ---
[INFO] Building jar: <http://jenkins.buildacloud.org/job/build-master-noredist/ws/plugins/alert-handlers/syslog-alerts/target/cloud-plugin-syslog-alerts-4.3.0-SNAPSHOT.jar>
[INFO] 
[INFO] --- maven-site-plugin:3.1:attach-descriptor (attach-descriptor) @ cloud-plugin-syslog-alerts
---
[INFO] 
[INFO] --- maven-install-plugin:2.3.1:install (default-install) @ cloud-plugin-syslog-alerts
---
[INFO] Installing <http://jenkins.buildacloud.org/job/build-master-noredist/ws/plugins/alert-handlers/syslog-alerts/target/cloud-plugin-syslog-alerts-4.3.0-SNAPSHOT.jar>
to /home/jenkins/.m2/repository/org/apache/cloudstack/cloud-plugin-syslog-alerts/4.3.0-SNAPSHOT/cloud-plugin-syslog-alerts-4.3.0-SNAPSHOT.jar
[INFO] Installing <http://jenkins.buildacloud.org/job/build-master-noredist/ws/plugins/alert-handlers/syslog-alerts/pom.xml>
to /home/jenkins/.m2/repository/org/apache/cloudstack/cloud-plugin-syslog-alerts/4.3.0-SNAPSHOT/cloud-plugin-syslog-alerts-4.3.0-SNAPSHOT.pom
[INFO]                                                                         
[INFO] ------------------------------------------------------------------------
[INFO] Building Apache CloudStack Plugin - Network Internal Load Balancer 4.3.0-SNAPSHOT
[INFO] ------------------------------------------------------------------------
[INFO] 
[INFO] --- maven-clean-plugin:2.5:clean (default-clean) @ cloud-plugin-network-internallb
---
[INFO] Deleting <http://jenkins.buildacloud.org/job/build-master-noredist/ws/plugins/network-elements/internal-loadbalancer/target>
(includes = [**/*], excludes = [])
[INFO] Deleting <http://jenkins.buildacloud.org/job/build-master-noredist/ws/plugins/network-elements/internal-loadbalancer>
(includes = [target, dist], excludes = [])
[INFO] 
[INFO] --- maven-remote-resources-plugin:1.3:process (default) @ cloud-plugin-network-internallb
---
[INFO] 
[INFO] --- maven-resources-plugin:2.5:resources (default-resources) @ cloud-plugin-network-internallb
---
[debug] execute contextualize
[INFO] Using 'UTF-8' encoding to copy filtered resources.
[INFO] Copying 1 resource
[INFO] Copying 3 resources
[INFO] 
[INFO] --- maven-compiler-plugin:2.5.1:compile (default-compile) @ cloud-plugin-network-internallb
---
[INFO] Compiling 3 source files to <http://jenkins.buildacloud.org/job/build-master-noredist/ws/plugins/network-elements/internal-loadbalancer/target/classes>
[INFO] 
[INFO] --- maven-resources-plugin:2.5:testResources (default-testResources) @ cloud-plugin-network-internallb
---
[debug] execute contextualize
[INFO] Using 'UTF-8' encoding to copy filtered resources.
[INFO] Copying 3 resources
[INFO] Copying 3 resources
[INFO] 
[INFO] --- maven-compiler-plugin:2.5.1:testCompile (default-testCompile) @ cloud-plugin-network-internallb
---
[INFO] Compiling 6 source files to <http://jenkins.buildacloud.org/job/build-master-noredist/ws/plugins/network-elements/internal-loadbalancer/target/test-classes>
[INFO] 
[INFO] --- maven-surefire-plugin:2.12:test (default-test) @ cloud-plugin-network-internallb
---
[INFO] Surefire report directory: <http://jenkins.buildacloud.org/job/build-master-noredist/ws/plugins/network-elements/internal-loadbalancer/target/surefire-reports>

-------------------------------------------------------
 T E S T S
-------------------------------------------------------
Running org.apache.cloudstack.internallbelement.InternalLbElementTest
log4j:WARN No appenders could be found for logger (org.springframework.test.context.junit4.SpringJUnit4ClassRunner).
log4j:WARN Please initialize the log4j system properly.
log4j:WARN See http://logging.apache.org/log4j/1.2/faq.html#noconfig for more info.
Tests run: 10, Failures: 0, Errors: 0, Skipped: 0, Time elapsed: 8.126 sec
Running org.apache.cloudstack.internallbelement.InternalLbElementServiceTest
Tests run: 9, Failures: 0, Errors: 0, Skipped: 0, Time elapsed: 0.153 sec
Running org.apache.cloudstack.internallbvmmgr.InternalLBVMServiceTest
Tests run: 6, Failures: 0, Errors: 0, Skipped: 0, Time elapsed: 2.306 sec
Running org.apache.cloudstack.internallbvmmgr.InternalLBVMManagerTest
Tests run: 10, Failures: 0, Errors: 0, Skipped: 0, Time elapsed: 1.064 sec

Results :

Tests run: 35, Failures: 0, Errors: 0, Skipped: 0

[INFO] 
[INFO] --- maven-jar-plugin:2.4:jar (default-jar) @ cloud-plugin-network-internallb ---
[INFO] Building jar: <http://jenkins.buildacloud.org/job/build-master-noredist/ws/plugins/network-elements/internal-loadbalancer/target/cloud-plugin-network-internallb-4.3.0-SNAPSHOT.jar>
[INFO] 
[INFO] --- maven-site-plugin:3.1:attach-descriptor (attach-descriptor) @ cloud-plugin-network-internallb
---
[INFO] 
[INFO] --- maven-install-plugin:2.3.1:install (default-install) @ cloud-plugin-network-internallb
---
[INFO] Installing <http://jenkins.buildacloud.org/job/build-master-noredist/ws/plugins/network-elements/internal-loadbalancer/target/cloud-plugin-network-internallb-4.3.0-SNAPSHOT.jar>
to /home/jenkins/.m2/repository/org/apache/cloudstack/cloud-plugin-network-internallb/4.3.0-SNAPSHOT/cloud-plugin-network-internallb-4.3.0-SNAPSHOT.jar
[INFO] Installing <http://jenkins.buildacloud.org/job/build-master-noredist/ws/plugins/network-elements/internal-loadbalancer/pom.xml>
to /home/jenkins/.m2/repository/org/apache/cloudstack/cloud-plugin-network-internallb/4.3.0-SNAPSHOT/cloud-plugin-network-internallb-4.3.0-SNAPSHOT.pom
[INFO]                                                                         
[INFO] ------------------------------------------------------------------------
[INFO] Building Apache CloudStack Plugin - Network VXLAN 4.3.0-SNAPSHOT
[INFO] ------------------------------------------------------------------------
[INFO] 
[INFO] --- maven-clean-plugin:2.5:clean (default-clean) @ cloud-plugin-network-vxlan ---
[INFO] Deleting <http://jenkins.buildacloud.org/job/build-master-noredist/ws/plugins/network-elements/vxlan/target>
(includes = [**/*], excludes = [])
[INFO] Deleting <http://jenkins.buildacloud.org/job/build-master-noredist/ws/plugins/network-elements/vxlan>
(includes = [target, dist], excludes = [])
[INFO] 
[INFO] --- maven-remote-resources-plugin:1.3:process (default) @ cloud-plugin-network-vxlan
---
[INFO] 
[INFO] --- maven-resources-plugin:2.5:resources (default-resources) @ cloud-plugin-network-vxlan
---
[debug] execute contextualize
[INFO] Using 'UTF-8' encoding to copy filtered resources.
[INFO] Copying 2 resources
[INFO] Copying 3 resources
[INFO] 
[INFO] --- maven-compiler-plugin:2.5.1:compile (default-compile) @ cloud-plugin-network-vxlan
---
[INFO] Compiling 1 source file to <http://jenkins.buildacloud.org/job/build-master-noredist/ws/plugins/network-elements/vxlan/target/classes>
[INFO] 
[INFO] --- maven-resources-plugin:2.5:testResources (default-testResources) @ cloud-plugin-network-vxlan
---
[debug] execute contextualize
[INFO] Using 'UTF-8' encoding to copy filtered resources.
[INFO] skip non existing resourceDirectory <http://jenkins.buildacloud.org/job/build-master-noredist/ws/plugins/network-elements/vxlan/test/resources>
[INFO] Copying 3 resources
[INFO] 
[INFO] --- maven-compiler-plugin:2.5.1:testCompile (default-testCompile) @ cloud-plugin-network-vxlan
---
[INFO] Compiling 1 source file to <http://jenkins.buildacloud.org/job/build-master-noredist/ws/plugins/network-elements/vxlan/target/test-classes>
[INFO] 
[INFO] --- maven-surefire-plugin:2.12:test (default-test) @ cloud-plugin-network-vxlan ---
[INFO] Surefire report directory: <http://jenkins.buildacloud.org/job/build-master-noredist/ws/plugins/network-elements/vxlan/target/surefire-reports>

-------------------------------------------------------
 T E S T S
-------------------------------------------------------
Invalid or corrupt jarfile <http://jenkins.buildacloud.org/job/build-master-noredist/ws/plugins/network-elements/vxlan/target/surefire/surefirebooter7774246737660286153.jar>

Results :

Tests run: 0, Failures: 0, Errors: 0, Skipped: 0

[INFO] ------------------------------------------------------------------------
[INFO] Reactor Summary:
[INFO] 
[INFO] Apache CloudStack ................................. SUCCESS [13.049s]
[INFO] Apache CloudStack Maven Conventions Parent ........ SUCCESS [0.536s]
[INFO] Apache CloudStack Framework - Managed Context ..... SUCCESS [21.771s]
[INFO] Apache CloudStack Utils ........................... SUCCESS [52.190s]
[INFO] Apache CloudStack Framework ....................... SUCCESS [0.195s]
[INFO] Apache CloudStack Framework - Event Notification .. SUCCESS [31.277s]
[INFO] Apache CloudStack Framework - Configuration ....... SUCCESS [20.730s]
[INFO] Apache CloudStack API ............................. SUCCESS [1:03.509s]
[INFO] Apache CloudStack Framework - REST ................ SUCCESS [15.023s]
[INFO] Apache CloudStack Framework - IPC ................. SUCCESS [27.485s]
[INFO] Apache CloudStack Cloud Engine .................... SUCCESS [0.170s]
[INFO] Apache CloudStack Cloud Engine API ................ SUCCESS [21.028s]
[INFO] Apache CloudStack Core ............................ SUCCESS [41.461s]
[INFO] Apache CloudStack Agents .......................... SUCCESS [33.771s]
[INFO] Apache CloudStack Framework - Clustering .......... SUCCESS [22.227s]
[INFO] Apache CloudStack Framework - Jobs ................ SUCCESS [21.045s]
[INFO] Apache CloudStack Cloud Engine Schema Component ... SUCCESS [58.683s]
[INFO] Apache CloudStack Framework - Event Notification .. SUCCESS [13.471s]
[INFO] Apache CloudStack Cloud Engine Internal Components API  SUCCESS [17.450s]
[INFO] Apache CloudStack Server .......................... SUCCESS [3:19.111s]
[INFO] Apache CloudStack Usage Server .................... SUCCESS [38.548s]
[INFO] Apache XenSource XAPI ............................. SUCCESS [25.457s]
[INFO] Apache CloudStack Cloud Engine Orchestration Component  SUCCESS [44.040s]
[INFO] Apache CloudStack Cloud Services .................. SUCCESS [0.254s]
[INFO] Apache CloudStack Secondary Storage Service ....... SUCCESS [26.911s]
[INFO] Apache CloudStack Engine Storage Component ........ SUCCESS [30.402s]
[INFO] Apache CloudStack Engine Storage Volume Component . SUCCESS [23.376s]
[INFO] Apache CloudStack Engine Storage Image Component .. SUCCESS [18.845s]
[INFO] Apache CloudStack Engine Storage Data Motion Component  SUCCESS [15.013s]
[INFO] Apache CloudStack Engine Storage Cache Component .. SUCCESS [17.153s]
[INFO] Apache CloudStack Engine Storage Snapshot Component  SUCCESS [36.555s]
[INFO] Apache CloudStack Cloud Engine API ................ SUCCESS [13.209s]
[INFO] Apache CloudStack Cloud Engine Service ............ SUCCESS [30.480s]
[INFO] Apache CloudStack Plugin POM ...................... SUCCESS [4.139s]
[INFO] Apache CloudStack Plugin - API Rate Limit ......... SUCCESS [29.033s]
[INFO] Apache CloudStack Plugin - API Discovery .......... SUCCESS [25.263s]
[INFO] Apache CloudStack Plugin - ACL Static Role Based .. SUCCESS [15.812s]
[INFO] Apache CloudStack Plugin - Host Anti-Affinity Processor  SUCCESS [19.441s]
[INFO] Apache CloudStack Plugin - Explicit Dedication Processor  SUCCESS [14.013s]
[INFO] Apache CloudStack Plugin - User Concentrated Pod Deployment Planner  SUCCESS [14.458s]
[INFO] Apache CloudStack Plugin - User Dispersing Deployment Planner  SUCCESS [12.404s]
[INFO] Apache CloudStack Plugin - Implicit Dedication Planner  SUCCESS [34.580s]
[INFO] Apache CloudStack Plugin - Host Allocator Random .. SUCCESS [16.630s]
[INFO] Apache CloudStack Plugin - Dedicated Resources .... SUCCESS [33.757s]
[INFO] Apache CloudStack Plugin - Hypervisor OracleVM .... SUCCESS [19.797s]
[INFO] Apache CloudStack Plugin - Open vSwitch ........... SUCCESS [20.860s]
[INFO] Apache CloudStack Plugin - Hypervisor Xen ......... SUCCESS [45.811s]
[INFO] Apache CloudStack Plugin - Hypervisor KVM ......... SUCCESS [47.455s]
[INFO] Apache CloudStack Plugin - RabbitMQ Event Bus ..... SUCCESS [13.160s]
[INFO] Apache CloudStack Plugin - Hypervisor Baremetal ... SUCCESS [26.907s]
[INFO] Apache CloudStack Plugin - Hypervisor UCS ......... SUCCESS [17.233s]
[INFO] Apache CloudStack Plugin - Network Elastic Load Balancer  SUCCESS [28.838s]
[INFO] Apache CloudStack Plugin - Network Nicira NVP ..... SUCCESS [40.851s]
[INFO] Apache CloudStack Plugin - BigSwitch Virtual Network Segment  SUCCESS [31.792s]
[INFO] Apache CloudStack Plugin - Midokura Midonet ....... SUCCESS [40.766s]
[INFO] Apache Cloudstack Plugin - Stratosphere SSP ....... SUCCESS [29.617s]
[INFO] Apache CloudStack Plugin - Storage Allocator Random  SUCCESS [14.930s]
[INFO] Apache CloudStack Plugin - User Authenticator LDAP  SUCCESS [18.161s]
[INFO] Apache CloudStack Plugin - User Authenticator MD5 . SUCCESS [12.755s]
[INFO] Apache CloudStack Plugin - User Authenticator Plain Text  SUCCESS [12.681s]
[INFO] Apache CloudStack Plugin - User Authenticator SHA256 Salted  SUCCESS [20.128s]
[INFO] Apache CloudStack Plugin - Dns Notifier Example ... SUCCESS [11.144s]
[INFO] Apache CloudStack Plugin - Storage Image S3 ....... SUCCESS [13.806s]
[INFO] Apache CloudStack Plugin - Storage Image Swift provider  SUCCESS [12.981s]
[INFO] Apache CloudStack Plugin - Storage Image default provider  SUCCESS [14.292s]
[INFO] Apache CloudStack Plugin - Storage Image sample provider  SUCCESS [10.530s]
[INFO] Apache CloudStack Plugin - Storage Volume SolidFire Provider  SUCCESS [18.249s]
[INFO] Apache CloudStack Plugin - Storage Volume default provider  SUCCESS [11.911s]
[INFO] Apache CloudStack Plugin - Storage Volume sample provider  SUCCESS [11.060s]
[INFO] Apache CloudStack Plugin - SNMP Alerts ............ SUCCESS [21.329s]
[INFO] Apache CloudStack Plugin - Syslog Alerts .......... SUCCESS [18.927s]
[INFO] Apache CloudStack Plugin - Network Internal Load Balancer  SUCCESS [32.538s]
[INFO] Apache CloudStack Plugin - Network VXLAN .......... FAILURE [14.141s]
[INFO] Apache CloudStack Framework - Spring Life Cycle ... SKIPPED
[INFO] cloud-framework-spring-module ..................... SKIPPED
[INFO] Apache CloudStack Test ............................ SKIPPED
[INFO] Apache CloudStack Console Proxy ................... SKIPPED
[INFO] Apache CloudStack Console Proxy - Server .......... SKIPPED
[INFO] Apache CloudStack System VM ....................... SKIPPED
[INFO] Apache CloudStack Client UI ....................... SKIPPED
[INFO] Apache CloudStack Framework - QuickCloud .......... SKIPPED
[INFO] Apache CloudStack AWS API Bridge .................. SKIPPED
[INFO] ------------------------------------------------------------------------
[INFO] BUILD FAILURE
[INFO] ------------------------------------------------------------------------
[INFO] Total time: 30:58.987s
[INFO] Finished at: Wed Oct 30 19:30:44 EDT 2013
[INFO] Final Memory: 49M/259M
[INFO] ------------------------------------------------------------------------
[ERROR] Failed to execute goal org.apache.maven.plugins:maven-surefire-plugin:2.12:test (default-test)
on project cloud-plugin-network-vxlan: Error occurred in starting fork, check output in log
-> [Help 1]
[ERROR] 
[ERROR] To see the full stack trace of the errors, re-run Maven with the -e switch.
[ERROR] Re-run Maven using the -X switch to enable full debug logging.
[ERROR] 
[ERROR] For more information about the errors and possible solutions, please read the following
articles:
[ERROR] [Help 1] http://cwiki.apache.org/confluence/display/MAVEN/MojoExecutionException
[ERROR] 
[ERROR] After correcting the problems, you can resume the build with the command
[ERROR]   mvn <goals> -rf :cloud-plugin-network-vxlan
Build step 'Invoke top-level Maven targets' marked build as failure
Archiving artifacts
Skipping Cobertura coverage report as build was not SUCCESS or better ...

Mime
View raw message