cloudstack-dev mailing list archives

Site index · List index
Message view « Date » · « Thread »
Top « Date » · « Thread »
From Wei ZHOU <ustcweiz...@gmail.com>
Subject Re: Build failure on master (KVM related)
Date Tue, 17 Sep 2013 18:34:14 GMT
build successfully after install java-1.7.0-openjdk.x86_64 and
java-1.7.0-openjdk-devel.x86_64, and set the JAVA_HOME


2013/9/17 Mike Tutkowski <mike.tutkowski@solidfire.com>

> Got that e-mail lying around somewhere.
>
> Thanks
>
>
> On Tue, Sep 17, 2013 at 11:49 AM, Marcus Sorensen <shadowsor@gmail.com
> >wrote:
>
> > See email thread 'Libvirt-java 0.5.0 has been released', it's due to
> that.
> >
> > On Tue, Sep 17, 2013 at 11:45 AM, Marcus Sorensen <shadowsor@gmail.com>
> > wrote:
> > > I made the last commit, but I know it  wasn't that. My change was a
> > > simple string change, it wouldn't affect compilation. I'm looking at
> > > it to see if I can determine the source.
> > >
> > > On Tue, Sep 17, 2013 at 11:41 AM, Mike Tutkowski
> > > <mike.tutkowski@solidfire.com> wrote:
> > >> Just updated and ran mvn -P developer,systemvm clean install (twice -
> > with
> > >> the same results)
> > >>
> > >> [INFO] Apache CloudStack Plugin - Host Allocator Random .. SUCCESS
> > [2.299s]
> > >> [INFO] Apache CloudStack Plugin - Dedicated Resources .... SUCCESS
> > [6.294s]
> > >> [INFO] Apache CloudStack Plugin - Hypervisor OracleVM .... SUCCESS
> > [3.454s]
> > >> [INFO] Apache CloudStack Plugin - Open vSwitch ........... SUCCESS
> > [3.893s]
> > >> [INFO] Apache CloudStack Plugin - Hypervisor Xen ......... SUCCESS
> > [8.444s]
> > >> [INFO] Apache CloudStack Plugin - Hypervisor KVM ......... FAILURE
> > [6.461s]
> > >>
> > >> [INFO]
> > >>
> ------------------------------------------------------------------------
> > >> [INFO] BUILD FAILURE
> > >> [INFO]
> > >>
> ------------------------------------------------------------------------
> > >> [INFO] Total time: 3:41.533s
> > >> [INFO] Finished at: Tue Sep 17 11:40:04 MDT 2013
> > >> [INFO] Final Memory: 38M/101M
> > >> [INFO]
> > >>
> ------------------------------------------------------------------------
> > >> [ERROR] Failed to execute goal
> > >> org.apache.maven.plugins:maven-surefire-plugin:2.14:test
> (default-test)
> > on
> > >> project cloud-plugin-hypervisor-kvm: There are test failures.
> > >> [ERROR]
> > >> [ERROR] Please refer to
> > >>
> >
> /Users/mtutkowski/Documents/CloudStack/src/CloudStack/plugins/hypervisors/kvm/target/surefire-reports
> > >> for the individual test results.
> > >> [ERROR] -> [Help 1]
> > >> [ERROR]
> > >> [ERROR] To see the full stack trace of the errors, re-run Maven with
> > the -e
> > >> switch.
> > >> [ERROR] Re-run Maven using the -X switch to enable full debug logging.
> > >> [ERROR]
> > >> [ERROR] For more information about the errors and possible solutions,
> > >> please read the following articles:
> > >> [ERROR] [Help 1]
> > >> http://cwiki.apache.org/confluence/display/MAVEN/MojoFailureException
> > >> [ERROR]
> > >> [ERROR] After correcting the problems, you can resume the build with
> the
> > >> command
> > >> [ERROR]   mvn <goals> -rf :cloud-plugin-hypervisor-kvm
> > >>
> > >>
> > >> --
> > >> *Mike Tutkowski*
> > >> *Senior CloudStack Developer, SolidFire Inc.*
> > >> e: mike.tutkowski@solidfire.com
> > >> o: 303.746.7302
> > >> Advancing the way the world uses the
> > >> cloud<http://solidfire.com/solution/overview/?video=play>
> > >> *™*
> >
>
>
>
> --
> *Mike Tutkowski*
> *Senior CloudStack Developer, SolidFire Inc.*
> e: mike.tutkowski@solidfire.com
> o: 303.746.7302
> Advancing the way the world uses the
> cloud<http://solidfire.com/solution/overview/?video=play>
> *™*
>

Mime
  • Unnamed multipart/alternative (inline, None, 0 bytes)
View raw message