cloudstack-dev mailing list archives

Site index · List index
Message view « Date » · « Thread »
Top « Date » · « Thread »
From Rayees Namathponnan <rayees.namathpon...@citrix.com>
Subject Compilation failed in 4.2
Date Fri, 12 Jul 2013 22:08:24 GMT
Compilation failed in 4.2 , someone please look this ?


[INFO] Copying 3 resources
[INFO]
[INFO] --- maven-compiler-plugin:2.5.1:compile (default-compile) @ cloud-plugin-hypervisor-vmware
---
[INFO] Compiling 48 source files to /root/jenkins/build/workspace/CloudPlatform-4.2-rhel63/cloudplatform/cloudstack/dist/rpmbuild/BUILD/cloudstack-4.2.0-SNAPSHOT/plugins/hypervisors/vmware/target/classes
[INFO] -------------------------------------------------------------
[ERROR] COMPILATION ERROR :
[INFO] -------------------------------------------------------------
[ERROR] VmwareResource.java:[2048,20] cannot find symbol
symbol  : variable routerIp
location: class com.cloud.hypervisor.vmware.resource.VmwareResource
[ERROR] VmwareResource.java:[2088,20] cannot find symbol
symbol  : variable routerIp
location: class com.cloud.hypervisor.vmware.resource.VmwareResource
[INFO] 2 errors
[INFO] -------------------------------------------------------------
[INFO] ------------------------------------------------------------------------


Regards,
Rayees

Mime
  • Unnamed multipart/alternative (inline, None, 0 bytes)
View raw message