cloudstack-dev mailing list archives

Site index · List index
Message view « Date » · « Thread »
Top « Date » · « Thread »
From Edison Su <Edison...@citrix.com>
Subject RE: Compilation failed in 4.2
Date Fri, 12 Jul 2013 23:15:02 GMT
Should be fixed.

> -----Original Message-----
> From: Edison Su [mailto:Edison.su@citrix.com]
> Sent: Friday, July 12, 2013 3:56 PM
> To: dev@cloudstack.apache.org
> Subject: RE: Compilation failed in 4.2
> 
> I fixed it on my local branch already, let me check it in.
> 
> > -----Original Message-----
> > From: Rayees Namathponnan [mailto:rayees.namathponnan@citrix.com]
> > Sent: Friday, July 12, 2013 3:08 PM
> > To: dev@cloudstack.apache.org
> > Subject: Compilation failed in 4.2
> >
> > Compilation failed in 4.2 , someone please look this ?
> >
> >
> > [INFO] Copying 3 resources
> > [INFO]
> > [INFO] --- maven-compiler-plugin:2.5.1:compile (default-compile) @
> > cloud- plugin-hypervisor-vmware --- [INFO] Compiling 48 source files
> > to
> > /root/jenkins/build/workspace/CloudPlatform-4.2-
> > rhel63/cloudplatform/cloudstack/dist/rpmbuild/BUILD/cloudstack-4.2.0-
> > SNAPSHOT/plugins/hypervisors/vmware/target/classes
> > [INFO] -------------------------------------------------------------
> > [ERROR] COMPILATION ERROR :
> > [INFO] -------------------------------------------------------------
> > [ERROR] VmwareResource.java:[2048,20] cannot find symbol symbol  :
> > variable routerIp
> > location: class com.cloud.hypervisor.vmware.resource.VmwareResource
> > [ERROR] VmwareResource.java:[2088,20] cannot find symbol symbol  :
> > variable routerIp
> > location: class com.cloud.hypervisor.vmware.resource.VmwareResource
> > [INFO] 2 errors
> > [INFO] -------------------------------------------------------------
> > [INFO]
> > ----------------------------------------------------------------------
> > --
> >
> >
> > Regards,
> > Rayees

Mime
View raw message