cloudstack-dev mailing list archives

Site index · List index
Message view « Date » · « Thread »
Top « Date » · « Thread »
From Daan Hoogland <DHoogl...@schubergphilis.com>
Subject master build breaks at com.cloud.vpc.NetworkACLServiceTest
Date Mon, 27 May 2013 05:49:08 GMT
LS,

Lately I've been getting, "com.cloud.exception.InvalidParameterValueException: ACL item with
number 1 already exists in ACL: null", while building cloudstack. I first thought it was my
own hack so I don't know when it was introduced (it is in a clean master that it happens).
The full surfire report follows:

-------------------------------------------------------------------------------
Test set: com.cloud.vpc.NetworkACLServiceTest
-------------------------------------------------------------------------------
Tests run: 5, Failures: 0, Errors: 1, Skipped: 0, Time elapsed: 0.219 sec <<< FAILURE!
testCreateACLItem(com.cloud.vpc.NetworkACLServiceTest)  Time elapsed: 0.016 sec  <<<
ERROR!
com.cloud.exception.InvalidParameterValueException: ACL item with number 1 already exists
in ACL: null
            at com.cloud.network.vpc.NetworkACLServiceImpl.createNetworkACLItem(NetworkACLServiceImpl.java:270)
            at com.cloud.vpc.NetworkACLServiceTest.testCreateACLItem(NetworkACLServiceTest.java:141)
            at sun.reflect.NativeMethodAccessorImpl.invoke0(Native Method)
            at sun.reflect.NativeMethodAccessorImpl.invoke(Unknown Source)
            at sun.reflect.DelegatingMethodAccessorImpl.invoke(Unknown Source)
            at java.lang.reflect.Method.invoke(Unknown Source)
            at org.junit.runners.model.FrameworkMethod$1.runReflectiveCall(FrameworkMethod.java:45)
            at org.junit.internal.runners.model.ReflectiveCallable.run(ReflectiveCallable.java:15)
            at org.junit.runners.model.FrameworkMethod.invokeExplosively(FrameworkMethod.java:42)
            at org.junit.internal.runners.statements.InvokeMethod.evaluate(InvokeMethod.java:20)
            at org.junit.internal.runners.statements.RunBefores.evaluate(RunBefores.java:28)
            at org.springframework.test.context.junit4.statements.RunBeforeTestMethodCallbacks.evaluate(RunBeforeTestMethodCallbacks.java:74)
            at org.springframework.test.context.junit4.statements.RunAfterTestMethodCallbacks.evaluate(RunAfterTestMethodCallbacks.java:83)
            at org.springframework.test.context.junit4.statements.SpringRepeat.evaluate(SpringRepeat.java:72)
            at org.springframework.test.context.junit4.SpringJUnit4ClassRunner.runChild(SpringJUnit4ClassRunner.java:231)
            at org.junit.runners.BlockJUnit4ClassRunner.runChild(BlockJUnit4ClassRunner.java:47)
            at org.junit.runners.ParentRunner$3.run(ParentRunner.java:231)
            at org.junit.runners.ParentRunner$1.schedule(ParentRunner.java:60)
            at org.junit.runners.ParentRunner.runChildren(ParentRunner.java:229)
            at org.junit.runners.ParentRunner.access$000(ParentRunner.java:50)
            at org.junit.runners.ParentRunner$2.evaluate(ParentRunner.java:222)
            at org.springframework.test.context.junit4.statements.RunBeforeTestClassCallbacks.evaluate(RunBeforeTestClassCallbacks.java:61)
            at org.springframework.test.context.junit4.statements.RunAfterTestClassCallbacks.evaluate(RunAfterTestClassCallbacks.java:71)
            at org.junit.runners.ParentRunner.run(ParentRunner.java:300)
            at org.springframework.test.context.junit4.SpringJUnit4ClassRunner.run(SpringJUnit4ClassRunner.java:174)
            at org.apache.maven.surefire.junit4.JUnit4Provider.execute(JUnit4Provider.java:236)
            at org.apache.maven.surefire.junit4.JUnit4Provider.executeTestSet(JUnit4Provider.java:134)
            at org.apache.maven.surefire.junit4.JUnit4Provider.invoke(JUnit4Provider.java:113)
            at sun.reflect.NativeMethodAccessorImpl.invoke0(Native Method)
            at sun.reflect.NativeMethodAccessorImpl.invoke(Unknown Source)
            at sun.reflect.DelegatingMethodAccessorImpl.invoke(Unknown Source)
            at java.lang.reflect.Method.invoke(Unknown Source)
            at org.apache.maven.surefire.util.ReflectionUtils.invokeMethodWithArray(ReflectionUtils.java:189)
            at org.apache.maven.surefire.booter.ProviderFactory$ProviderProxy.invoke(ProviderFactory.java:165)
            at org.apache.maven.surefire.booter.ProviderFactory.invokeProvider(ProviderFactory.java:85)
            at org.apache.maven.surefire.booter.ForkedBooter.runSuitesInProcess(ForkedBooter.java:103)
            at org.apache.maven.surefire.booter.ForkedBooter.main(ForkedBooter.java:74)

Mime
  • Unnamed multipart/alternative (inline, None, 0 bytes)
View raw message