cloudstack-dev mailing list archives

Site index · List index
Message view « Date » · « Thread »
Top « Date » · « Thread »
From Min Chen <>
Subject Master branch build is broken again
Date Mon, 04 Mar 2013 17:51:13 GMT
Hi there,

I could not compile master after pulling latest code today,  build failed with the following

[ERROR] Failed to execute goal org.apache.maven.plugins:maven-compiler-plugin:2.5.1:compile
(default-compile) on project cloud-engine-orchestration: Compilation failure
[ERROR] /Users/minc/dev/cloud-asf/engine/orchestration/src/org/apache/cloudstack/engine/cloud/entity/api/db/[52,7] is not abstract and does not override
abstract method getNewSvcOfferingId() in
[ERROR] -> [Help 1]

I checked the commit history, it seems related to commit e0019eccd997d9b2b3ff9395bcd99f821f5121db,
so CC Nitin here. Can somebody quickly fix this? This is blocking me from verifying CLOUDSTACK-1491
and merge my feature branch vim51_win8.


  • Unnamed multipart/alternative (inline, None, 0 bytes)
View raw message