cloudstack-dev mailing list archives

Site index · List index
Message view « Date » · « Thread »
Top « Date » · « Thread »
From Chiradeep Vittal <Chiradeep.Vit...@citrix.com>
Subject Re: Build failed in Jenkins: cloudstack-apidocs-master #273
Date Fri, 22 Feb 2013 20:34:48 GMT
Fixed



On 2/22/13 7:41 AM, "Apache Jenkins Server" <jenkins@builds.apache.org>
wrote:

>See <https://builds.apache.org/job/cloudstack-apidocs-master/273/changes>
>
>Changes:
>
>[pranav.saxena] CPU&RAM overcommit ratio uI integration code
>
>[murali.reddy] CLOUDSTACK-705 IP Address reservation for Isolated Guest
>Networks
>
>[aprateek] Cloudstack-711: Cpu and Ram Overcommit Ratio.
>
>[pranav.saxena] Cpu and Memory overcommit ratio Ui integration
>
>[trippie] Capture stderr and stdout of the jsvc run services (agent and
>usage)
>
>[bhaisaab] CLOUDSTACK-1373: Fix regression in db-schema due to recent
>branch merges
>
>[bhaisaab] CLOUDSTACK-1355: Don't check foreign key constraint during db
>upgrades
>
>[aprateek] CLOUDSTACK 711: CPU and RAM overcommit update cluster part
>
>[jzb] resize volume
>
>[htrippaers] CLOUDSTACK-1373: Fix regression in db-schema due to recent
>branch merges
>
>------------------------------------------
>[...truncated 3240 lines...]
>[INFO]
>[INFO] --- maven-jar-plugin:2.4:jar (default-jar) @ cloud-testclient ---
>[INFO] Building jar:
><https://builds.apache.org/job/cloudstack-apidocs-master/ws/test/target/cl
>oud-testclient-4.2.0-SNAPSHOT.jar>
>[INFO]
>[INFO] --- maven-site-plugin:3.1:attach-descriptor (attach-descriptor) @
>cloud-testclient ---
>[INFO]
>[INFO] --- maven-jar-plugin:2.4:test-jar (default) @ cloud-testclient ---
>[INFO] Building jar:
><https://builds.apache.org/job/cloudstack-apidocs-master/ws/test/target/cl
>oud-testclient-4.2.0-SNAPSHOT-tests.jar>
>[INFO] Installing
><https://builds.apache.org/job/cloudstack-apidocs-master/ws/test/target/cl
>oud-testclient-4.2.0-SNAPSHOT.jar> to
>/home/jenkins/jenkins-slave/maven-repositories/1/org/apache/cloudstack/clo
>ud-testclient/4.2.0-SNAPSHOT/cloud-testclient-4.2.0-SNAPSHOT.jar
>[INFO]
>[INFO] --- maven-install-plugin:2.3.1:install (default-install) @
>cloud-testclient ---
>[INFO] Installing
><https://builds.apache.org/job/cloudstack-apidocs-master/ws/test/pom.xml>
>to
>/home/jenkins/jenkins-slave/maven-repositories/1/org/apache/cloudstack/clo
>ud-testclient/4.2.0-SNAPSHOT/cloud-testclient-4.2.0-SNAPSHOT.pom
>[INFO] Installing
><https://builds.apache.org/job/cloudstack-apidocs-master/ws/test/target/cl
>oud-testclient-4.2.0-SNAPSHOT-tests.jar> to
>/home/jenkins/jenkins-slave/maven-repositories/1/org/apache/cloudstack/clo
>ud-testclient/4.2.0-SNAPSHOT/cloud-testclient-4.2.0-SNAPSHOT-tests.jar
>[INFO]
>
>[INFO]
>------------------------------------------------------------------------
>[INFO] Building Apache CloudStack Client UI 4.2.0-SNAPSHOT
>[INFO]
>------------------------------------------------------------------------
>[INFO] Deleting
><https://builds.apache.org/job/cloudstack-apidocs-master/ws/client/target>
>[INFO]
>[INFO] --- maven-clean-plugin:2.5:clean (default-clean) @ cloud-client-ui
>---
>[INFO]
>[INFO] --- maven-remote-resources-plugin:1.3:process (default) @
>cloud-client-ui ---
>Downloading:
>http://repo.maven.apache.org/maven2/org/libvirt/libvirt/0.4.9/libvirt-0.4.
>9.pom
>[INFO]
>[INFO] --- maven-antrun-plugin:1.7:run (generate-resource) @
>cloud-client-ui ---
>[INFO] Executing tasks
>
>main:
>     [exec] cp: cannot create directory
>`<https://builds.apache.org/job/cloudstack-apidocs-master/ws/client/target
>/generated-webapp/WEB-INF/classes/scripts'>: No such file or directory
>     [exec] Result: 1
>     [copy] Copying 1 file to
><https://builds.apache.org/job/cloudstack-apidocs-master/ws/client/target/
>generated-webapp/WEB-INF>
>     [copy] Copying 7 files to
><https://builds.apache.org/job/cloudstack-apidocs-master/ws/client/target/
>generated-webapp/WEB-INF/classes>
>     [copy] Copying 1 file to
><https://builds.apache.org/job/cloudstack-apidocs-master/ws/client/target/
>generated-webapp/WEB-INF/classes/vms>
>     [copy] Copying 157 files to
><https://builds.apache.org/job/cloudstack-apidocs-master/ws/client/target/
>generated-webapp>
>     [copy] Copying 24 files to
><https://builds.apache.org/job/cloudstack-apidocs-master/ws/client/target/
>generated-webapp/WEB-INF/classes>
>     [copy] Copying 24 files to
><https://builds.apache.org/job/cloudstack-apidocs-master/ws/client/target/
>generated-webapp/WEB-INF/classes>
>     [copy] Copying 6 files to
><https://builds.apache.org/job/cloudstack-apidocs-master/ws/client/target/
>utilities/bin>
>     [copy] Copying 2 files to
><https://builds.apache.org/job/cloudstack-apidocs-master/ws/client/target/
>utilities/bin>
>     [copy] Copying 60 files to
><https://builds.apache.org/job/cloudstack-apidocs-master/ws/client/target/
>utilities/scripts/db>
>[INFO] Executed tasks
>[INFO] [debug] execute contextualize
>[INFO] Using 'UTF-8' encoding to copy filtered resources.
>[INFO] skip non existing resourceDirectory
><https://builds.apache.org/job/cloudstack-apidocs-master/ws/client/src/mai
>n/resources>
>[INFO] Copying 3 resources
>
>[INFO] --- maven-resources-plugin:2.5:resources (default-resources) @
>cloud-client-ui ---
>[INFO]
>[INFO] --- maven-antrun-plugin:1.7:run (process-nonoss) @ cloud-client-ui
>---
>[INFO] Executing tasks
>
>main:
>[INFO] Executed tasks
>[INFO]
>[INFO] --- maven-antrun-plugin:1.7:run (process-nonoss-spring-context) @
>cloud-client-ui ---
>[INFO] Executing tasks
>
>main:
>[INFO] Executed tasks
>[INFO] [INFO] No sources to compile
>
>[INFO] --- maven-compiler-plugin:2.5.1:compile (default-compile) @
>cloud-client-ui ---
>[INFO] [debug] execute contextualize
>[INFO] Using 'UTF-8' encoding to copy filtered resources.
>[INFO] skip non existing resourceDirectory
><https://builds.apache.org/job/cloudstack-apidocs-master/ws/client/src/tes
>t/resources>
>[INFO] Copying 3 resources
>
>[INFO] --- maven-resources-plugin:2.5:testResources
>(default-testResources) @ cloud-client-ui ---
>[INFO] [INFO] No sources to compile
>
>[INFO] --- maven-compiler-plugin:2.5.1:testCompile (default-testCompile)
>@ cloud-client-ui ---
>[INFO] [INFO] Surefire report directory:
><https://builds.apache.org/job/cloudstack-apidocs-master/ws/client/target/
>surefire-reports>
>
>[INFO]
>-------------------------------------------------------
> T E S T S
>-------------------------------------------------------
>--- maven-surefire-plugin:2.12:test (default-test) @ cloud-client-ui ---
>
>Results :
>
>Tests run: 0, Failures: 0, Errors: 0, Skipped: 0
>
>[JENKINS] Recording test results
>[INFO]
>[INFO] --- maven-war-plugin:2.3:war (default-war) @ cloud-client-ui ---
>[INFO] Packaging webapp
>[INFO] Assembling webapp [cloud-client-ui] in
>[<https://builds.apache.org/job/cloudstack-apidocs-master/ws/client/target
>/cloud-client-ui-4.2.0-SNAPSHOT]>
>[INFO] Processing war project
>[INFO] Copying webapp resources
>[<https://builds.apache.org/job/cloudstack-apidocs-master/ws/client/target
>/generated-webapp]>
>[INFO] Webapp assembled in [233 msecs]
>[INFO] Building war:
><https://builds.apache.org/job/cloudstack-apidocs-master/ws/client/target/
>cloud-client-ui-4.2.0-SNAPSHOT.war>
>[INFO]
>[INFO] --- maven-site-plugin:3.1:attach-descriptor (attach-descriptor) @
>cloud-client-ui ---
>[INFO] [INFO] Configured Artifact: org.jasypt:jasypt:1.9.0:jar
>[INFO] Configured Artifact: org.jasypt:jasypt:1.8:jar
>
>[INFO] --- maven-dependency-plugin:2.5.1:copy (copy) @ cloud-client-ui ---
>[INFO] Copying jasypt-1.9.0.jar to
><https://builds.apache.org/job/cloudstack-apidocs-master/ws/client/target/
>pythonlibs/jasypt-1.9.0.jar>
>[INFO] Copying jasypt-1.8.jar to
><https://builds.apache.org/job/cloudstack-apidocs-master/ws/client/target/
>pythonlibs/jasypt-1.8.jar>
>[INFO] [INFO] Installing
><https://builds.apache.org/job/cloudstack-apidocs-master/ws/client/target/
>cloud-client-ui-4.2.0-SNAPSHOT.war> to
>/home/jenkins/jenkins-slave/maven-repositories/1/org/apache/cloudstack/clo
>ud-client-ui/4.2.0-SNAPSHOT/cloud-client-ui-4.2.0-SNAPSHOT.war
>
>[INFO] --- maven-install-plugin:2.3.1:install (default-install) @
>cloud-client-ui ---
>[INFO] Installing
><https://builds.apache.org/job/cloudstack-apidocs-master/ws/client/pom.xml
>> to
>>/home/jenkins/jenkins-slave/maven-repositories/1/org/apache/cloudstack/cl
>>oud-client-ui/4.2.0-SNAPSHOT/cloud-client-ui-4.2.0-SNAPSHOT.pom
>[INFO]
>------------------------------------------------------------------------
>[INFO] Reactor Summary:
>[INFO]
>[INFO] Apache CloudStack ................................. SUCCESS
>[5.490s]
>[INFO] Apache CloudStack Utils ........................... SUCCESS
>[17.692s]
>[INFO] Apache CloudStack API ............................. SUCCESS
>[10.117s]
>[INFO] Apache CloudStack Framework ....................... SUCCESS
>[0.260s]
>[INFO] cloud-framework-api ............................... SUCCESS
>[1.399s]
>[INFO] Apache CloudStack Framework - REST ................ SUCCESS
>[3.349s]
>[INFO] Apache CloudStack Cloud Engine .................... SUCCESS
>[0.253s]
>[INFO] Apache CloudStack Cloud Engine API ................ SUCCESS
>[2.658s]
>[INFO] Apache CloudStack Core ............................ SUCCESS
>[4.626s]
>[INFO] Apache CloudStack Agents .......................... SUCCESS
>[4.400s]
>[INFO] Apache CloudStack Framework - Event Notification .. SUCCESS
>[1.722s]
>[INFO] Apache CloudStack Server .......................... SUCCESS
>[18.713s]
>[INFO] Apache CloudStack Usage Server .................... SUCCESS
>[4.422s]
>[INFO] Apache XenSource XAPI ............................. SUCCESS
>[3.099s]
>[INFO] Apache CloudStack Plugin POM ...................... SUCCESS
>[0.481s]
>[INFO] Apache CloudStack Plugin - API Rate Limit ......... SUCCESS
>[4.597s]
>[INFO] Apache CloudStack Plugin - API Discovery .......... SUCCESS
>[3.251s]
>[INFO] Apache CloudStack Plugin - ACL Static Role Based .. SUCCESS
>[2.162s]
>[INFO] Apache CloudStack Plugin - User Concentrated Pod Deployment
>Planner  SUCCESS [1.839s]
>[INFO] Apache CloudStack Plugin - User Dispersing Deployment Planner
>SUCCESS [2.171s]
>[INFO] Apache CloudStack Plugin - Host Allocator Random .. SUCCESS
>[2.222s]
>[INFO] Apache CloudStack Plugin - Hypervisor OracleVM .... SUCCESS
>[2.545s]
>[INFO] Apache CloudStack Framework - IPC ................. SUCCESS
>[3.109s]
>[INFO] Apache CloudStack Cloud Engine Internal Components API  SUCCESS
>[1.862s]
>[INFO] Apache CloudStack Engine Storage Component ........ SUCCESS
>[2.707s]
>[INFO] Apache CloudStack Plugin - Open vSwitch ........... SUCCESS
>[2.288s]
>[INFO] Apache CloudStack Plugin - Hypervisor Xen ......... SUCCESS
>[3.128s]
>[INFO] Apache CloudStack Plugin - Hypervisor KVM ......... SUCCESS
>[9.575s]
>[INFO] Apache CloudStack Plugin - RabbitMQ Event Bus ..... SUCCESS
>[2.258s]
>[INFO] Apache CloudStack Plugin - Hypervisor Simulator ... SUCCESS
>[2.503s]
>[INFO] Apache CloudStack Plugin - Hypervisor Baremetal ... SUCCESS
>[2.412s]
>[INFO] Apache CloudStack Plugin - Hypervisor UCS ......... SUCCESS
>[2.034s]
>[INFO] Apache CloudStack Plugin - Network Elastic Load Balancer  SUCCESS
>[2.096s]
>[INFO] Apache CloudStack Plugin - Network Nicira NVP ..... SUCCESS
>[4.808s]
>[INFO] Apache CloudStack Plugin - BigSwitch Virtual Network Segment
>SUCCESS [3.845s]
>[INFO] Apache CloudStack Plugin - Storage Allocator Random  SUCCESS
>[2.015s]
>[INFO] Apache CloudStack Plugin - User Authenticator LDAP  SUCCESS
>[1.927s]
>[INFO] Apache CloudStack Plugin - User Authenticator MD5 . SUCCESS
>[2.012s]
>[INFO] Apache CloudStack Plugin - User Authenticator Plain Text  SUCCESS
>[1.973s]
>[INFO] Apache CloudStack Plugin - User Authenticator SHA256 Salted
>SUCCESS [2.938s]
>[INFO] Apache CloudStack Plugin - Dns Notifier Example ... SUCCESS
>[2.144s]
>[INFO] Apache CloudStack Engine Storage Image Component .. SUCCESS
>[1.774s]
>[INFO] Apache CloudStack Plugin - Storage Image S3 ....... SUCCESS
>[1.307s]
>[INFO] Apache CloudStack Engine Storage Volume Component . SUCCESS
>[2.938s]
>[INFO] Apache CloudStack Plugin - Storage Volume solidfire  SUCCESS
>[2.340s]
>[INFO] Apache CloudStack SystemVM Patches ................ SUCCESS
>[0.625s]
>[INFO] Apache CloudStack Cloud Engine Compute Component .. SUCCESS
>[1.651s]
>[INFO] Apache CloudStack Cloud Engine Orchestration Component  SUCCESS
>[2.718s]
>[INFO] Apache CloudStack Engine Storage Image Motion Component  SUCCESS
>[1.578s]
>[INFO] Apache CloudStack Engine Storage Backup Component . SUCCESS
>[1.827s]
>[INFO] Apache CloudStack Engine Storage Snapshot Component  SUCCESS
>[2.999s]
>[INFO] Apache CloudStack Engine Storage integration test Component
>SUCCESS [2.464s]
>[INFO] Apache CloudStack Cloud Engine Schema Component ... SUCCESS
>[1.338s]
>[INFO] Apache CloudStack Cloud Engine API ................ SUCCESS
>[1.899s]
>[INFO] Apache CloudStack Cloud Engine Service ............ SUCCESS
>[5.212s]
>[INFO] Apache CloudStack Cloud Services .................. SUCCESS
>[0.250s]
>[INFO] Apache CloudStack Console Proxy Service ........... SUCCESS
>[0.239s]
>[INFO] Apache CloudStack Console Proxy Plugin ............ SUCCESS
>[0.254s]
>[INFO] Apache CloudStack Console Proxy ................... SUCCESS
>[6.382s]
>[INFO] Apache CloudStack Test ............................ SUCCESS
>[3.038s]
>[INFO] Apache CloudStack Client UI ....................... SUCCESS
>[5.950s]
>[INFO]
>------------------------------------------------------------------------
>[INFO] BUILD SUCCESS
>[INFO]
>------------------------------------------------------------------------
>[INFO] Total time: 3:22.322s
>[INFO] Finished at: Fri Feb 22 15:41:24 UTC 2013
>[INFO] Final Memory: 40M/185M
>[INFO]
>------------------------------------------------------------------------
>[JENKINS] Archiving disabled
>[JENKINS] Archiving disabled
>[JENKINS] Archiving disabled
>[JENKINS] Archiving disabled
>[JENKINS] Archiving disabled
>[JENKINS] Archiving disabled
>[JENKINS] Archiving disabled
>[JENKINS] Archiving disabled
>[JENKINS] Archiving disabled
>[JENKINS] Archiving disabled
>[JENKINS] Archiving disabled
>[JENKINS] Archiving disabled
>[JENKINS] Archiving disabled
>[JENKINS] Archiving disabled
>[JENKINS] Archiving disabled
>[JENKINS] Archiving disabled
>[JENKINS] Archiving disabled
>[JENKINS] Archiving disabled
>[JENKINS] Archiving disabled
>[JENKINS] Archiving disabled
>[JENKINS] Archiving disabled
>[JENKINS] Archiving disabled
>[JENKINS] Archiving disabled
>[JENKINS] Archiving disabled
>[JENKINS] Archiving disabled
>[JENKINS] Archiving disabled
>[JENKINS] Archiving disabled
>[JENKINS] Archiving disabled
>[JENKINS] Archiving disabled
>[JENKINS] Archiving disabled
>[JENKINS] Archiving disabled
>[JENKINS] Archiving disabled
>[JENKINS] Archiving disabled
>[JENKINS] Archiving disabled
>[JENKINS] Archiving disabled
>[JENKINS] Archiving disabled
>[JENKINS] Archiving disabled
>[JENKINS] Archiving disabled
>[JENKINS] Archiving disabled
>[JENKINS] Archiving disabled
>[JENKINS] Archiving disabled
>[JENKINS] Archiving disabled
>[JENKINS] Archiving disabled
>[JENKINS] Archiving disabled
>[JENKINS] Archiving disabled
>[JENKINS] Archiving disabled
>[JENKINS] Archiving disabled
>[JENKINS] Archiving disabled
>[JENKINS] Archiving disabled
>[JENKINS] Archiving disabled
>[JENKINS] Archiving disabled
>[JENKINS] Archiving disabled
>[JENKINS] Archiving disabled
>[JENKINS] Archiving disabled
>[JENKINS] Archiving disabled
>[JENKINS] Archiving disabled
>[JENKINS] Archiving disabled
>[JENKINS] Archiving disabled
>[JENKINS] Archiving disabled
>[JENKINS] Archiving disabled
>[JENKINS] Archiving disabled
>Waiting for Jenkins to finish collecting data
>channel stopped
>[cloudstack-apidocs-master] $ /bin/bash -xe
>/tmp/hudson7193885891616079175.sh
>+ mvn -P developer -pl :cloud-apidoc
>[INFO] Scanning for projects...
>[ERROR] Could not find the selected project in the reactor: :cloud-apidoc
>-> [Help 1]
>[ERROR]
>[ERROR] To see the full stack trace of the errors, re-run Maven with the
>-e switch.
>[ERROR] Re-run Maven using the -X switch to enable full debug logging.
>[ERROR]
>[ERROR] For more information about the errors and possible solutions,
>please read the following articles:
>[ERROR] [Help 1]
>http://cwiki.apache.org/confluence/display/MAVEN/MavenExecutionException
>Build step 'Execute shell' marked build as failure
>Archiving artifacts


Mime
View raw message