cloudstack-dev mailing list archives

Site index · List index
Message view « Date » · « Thread »
Top « Date » · « Thread »
From Edison Su <Edison...@citrix.com>
Subject Re: Error in deploying the config file - Python module not found
Date Fri, 02 Nov 2012 20:11:56 GMT
It's mysql-connector-python, not mysqldb or pymysql.

Sent from my iPhone

On Nov 2, 2012, at 11:11 AM, "Abhijith Chandrashekar" <Abhijith.Chandrashekar@citrix.com>
wrote:

> Hi all,
> 
> With the mgmt server running, as I run the last command as per https://cwiki.apache.org/confluence/display/CLOUDSTACK/CloudStack+devcloud+environment+setup,
I am facing this error -
> 
> [DEBUG] Executing command line: python ../marvin/marvin/deployDataCenter.py -i devcloud.cfg
> Traceback (most recent call last):
>  File "../marvin/marvin/deployDataCenter.py", line 21, in <module>
>    import cloudstackTestClient
>  File "/root/incubator-cloudstack/tools/marvin/marvin/cloudstackTestClient.py", line
20, in <module>
>    import dbConnection
>  File "/root/incubator-cloudstack/tools/marvin/marvin/dbConnection.py", line 19, in <module>
>    import mysql
> ImportError: No module named mysql
> [INFO] ------------------------------------------------------------------------
> [INFO] BUILD FAILURE
> [INFO] ------------------------------------------------------------------------
> [INFO] Total time: 2.655s
> [INFO] Finished at: Fri Nov 02 10:58:32 PDT 2012
> [INFO] Final Memory: 11M/28M
> [INFO] ------------------------------------------------------------------------
> [ERROR] Failed to execute goal org.codehaus.mojo:exec-maven-plugin:1.2.1:exec (default)
on project cloud-devcloud: Command execution failed. Process exited with an error: 1 (Exit
value: 1) -> [Help 1]
> org.apache.maven.lifecycle.LifecycleExecutionException: Failed to execute goal org.codehaus.mojo:exec-maven-plugin:1.2.1:exec
(default) on project cloud-devcloud: Command execution failed.
> at org.apache.maven.lifecycle.internal.MojoExecutor.execute(MojoExecutor.java:217)
> at org.apache.maven.lifecycle.internal.MojoExecutor.execute(MojoExecutor.java:153)
> at org.apache.maven.lifecycle.internal.MojoExecutor.execute(MojoExecutor.java:145)
> at org.apache.maven.lifecycle.internal.LifecycleModuleBuilder.buildProject(LifecycleModuleBuilder.java:84)
> at org.apache.maven.lifecycle.internal.LifecycleModuleBuilder.buildProject(LifecycleModuleBuilder.java:59)
> at org.apache.maven.lifecycle.internal.LifecycleStarter.singleThreadedBuild(LifecycleStarter.java:183)
> at org.apache.maven.lifecycle.internal.LifecycleStarter.execute(LifecycleStarter.java:161)
> at org.apache.maven.DefaultMaven.doExecute(DefaultMaven.java:320)
> at org.apache.maven.DefaultMaven.execute(DefaultMaven.java:156)
> at org.apache.maven.cli.MavenCli.execute(MavenCli.java:537)
> at org.apache.maven.cli.MavenCli.doMain(MavenCli.java:196)
> at org.apache.maven.cli.MavenCli.main(MavenCli.java:141)
> at sun.reflect.NativeMethodAccessorImpl.invoke0(Native Method)
> at sun.reflect.NativeMethodAccessorImpl.invoke(NativeMethodAccessorImpl.java:57)
> at sun.reflect.DelegatingMethodAccessorImpl.invoke(DelegatingMethodAccessorImpl.java:43)
> at java.lang.reflect.Method.invoke(Method.java:616)
> at org.codehaus.plexus.classworlds.launcher.Launcher.launchEnhanced(Launcher.java:290)
> at org.codehaus.plexus.classworlds.launcher.Launcher.launch(Launcher.java:230)
> at org.codehaus.plexus.classworlds.launcher.Launcher.mainWithExitCode(Launcher.java:409)
> at org.codehaus.plexus.classworlds.launcher.Launcher.main(Launcher.java:352)
> Caused by: org.apache.maven.plugin.MojoExecutionException: Command execution failed.
> at org.codehaus.mojo.exec.ExecMojo.execute(ExecMojo.java:362)
> at org.apache.maven.plugin.DefaultBuildPluginManager.executeMojo(DefaultBuildPluginManager.java:101)
> at org.apache.maven.lifecycle.internal.MojoExecutor.execute(MojoExecutor.java:209)
> ... 19 more
> Caused by: org.apache.commons.exec.ExecuteException: Process exited with an error: 1
(Exit value: 1)
> at org.apache.commons.exec.DefaultExecutor.executeInternal(DefaultExecutor.java:377)
> at org.apache.commons.exec.DefaultExecutor.execute(DefaultExecutor.java:160)
> at org.codehaus.mojo.exec.ExecMojo.executeCommandLine(ExecMojo.java:610)
> at org.codehaus.mojo.exec.ExecMojo.execute(ExecMojo.java:352)
> ... 21 more
> [ERROR]
> [ERROR]
> 
> 
> I already have the MySQLdb installed but this is a different module. I also have the
python-mysql module.
> 
> The reference to this exists in the tools/devcloud/pom.xml. Does anybody know how I can
instruct python about the location of this module or even check if I'm missing it.
> 
> Thanks,
> Abhijith

Mime
View raw message