cloudstack-commits mailing list archives

Site index · List index
Message view « Date » · « Thread »
Top « Date » · « Thread »
From Apache Jenkins Server <jenk...@builds.apache.org>
Subject Build failed in Jenkins: cloudstack-apidocs-master #2862
Date Mon, 30 May 2016 09:13:47 GMT
See <https://builds.apache.org/job/cloudstack-apidocs-master/2862/>

------------------------------------------
Started by an SCM change
[EnvInject] - Loading node environment variables.
Building remotely on ubuntu-6 (docker Ubuntu ubuntu yahoo-not-h2) in workspace <https://builds.apache.org/job/cloudstack-apidocs-master/ws/>
java.io.IOException: Failed to install https://repo.maven.apache.org/maven2/org/apache/maven/apache-maven/3.0.4/apache-maven-3.0.4-bin.zip
to /home/jenkins/tools/maven/apache-maven-3.0.4
	at hudson.FilePath.installIfNecessaryFrom(FilePath.java:832)
	at hudson.tools.DownloadFromUrlInstaller.performInstallation(DownloadFromUrlInstaller.java:75)
	at hudson.tools.InstallerTranslator.getToolHome(InstallerTranslator.java:68)
	at hudson.tools.ToolLocationNodeProperty.getToolHome(ToolLocationNodeProperty.java:108)
	at hudson.tools.ToolInstallation.translateFor(ToolInstallation.java:206)
	at hudson.tasks.Maven$MavenInstallation.forNode(Maven.java:624)
	at hudson.maven.MavenModuleSetBuild.getEnvironment(MavenModuleSetBuild.java:183)
	at hudson.plugins.git.GitSCM.checkout(GitSCM.java:1046)
	at hudson.scm.SCM.checkout(SCM.java:485)
	at hudson.model.AbstractProject.checkout(AbstractProject.java:1276)
	at hudson.model.AbstractBuild$AbstractBuildExecution.defaultCheckout(AbstractBuild.java:607)
	at jenkins.scm.SCMCheckoutStrategy.checkout(SCMCheckoutStrategy.java:86)
	at hudson.model.AbstractBuild$AbstractBuildExecution.run(AbstractBuild.java:529)
	at hudson.model.Run.execute(Run.java:1738)
	at hudson.maven.MavenModuleSetBuild.run(MavenModuleSetBuild.java:531)
	at hudson.model.ResourceController.execute(ResourceController.java:98)
	at hudson.model.Executor.run(Executor.java:410)
Caused by: java.io.IOException: Failed to mkdirs: /home/jenkins/tools/maven/apache-maven-3.0.4
	at hudson.FilePath.mkdirs(FilePath.java:1163)
	at hudson.FilePath.installIfNecessaryFrom(FilePath.java:798)
	... 16 more
Retrying after 10 seconds
java.io.IOException: Failed to install https://repo.maven.apache.org/maven2/org/apache/maven/apache-maven/3.0.4/apache-maven-3.0.4-bin.zip
to /home/jenkins/tools/maven/apache-maven-3.0.4
	at hudson.FilePath.installIfNecessaryFrom(FilePath.java:832)
	at hudson.tools.DownloadFromUrlInstaller.performInstallation(DownloadFromUrlInstaller.java:75)
	at hudson.tools.InstallerTranslator.getToolHome(InstallerTranslator.java:68)
	at hudson.tools.ToolLocationNodeProperty.getToolHome(ToolLocationNodeProperty.java:108)
	at hudson.tools.ToolInstallation.translateFor(ToolInstallation.java:206)
	at hudson.tasks.Maven$MavenInstallation.forNode(Maven.java:624)
	at hudson.maven.MavenModuleSetBuild.getEnvironment(MavenModuleSetBuild.java:183)
	at hudson.plugins.git.GitSCM.checkout(GitSCM.java:1046)
	at hudson.scm.SCM.checkout(SCM.java:485)
	at hudson.model.AbstractProject.checkout(AbstractProject.java:1276)
	at hudson.model.AbstractBuild$AbstractBuildExecution.defaultCheckout(AbstractBuild.java:607)
	at jenkins.scm.SCMCheckoutStrategy.checkout(SCMCheckoutStrategy.java:86)
	at hudson.model.AbstractBuild$AbstractBuildExecution.run(AbstractBuild.java:529)
	at hudson.model.Run.execute(Run.java:1738)
	at hudson.maven.MavenModuleSetBuild.run(MavenModuleSetBuild.java:531)
	at hudson.model.ResourceController.execute(ResourceController.java:98)
	at hudson.model.Executor.run(Executor.java:410)
Caused by: java.io.IOException: Failed to mkdirs: /home/jenkins/tools/maven/apache-maven-3.0.4
	at hudson.FilePath.mkdirs(FilePath.java:1163)
	at hudson.FilePath.installIfNecessaryFrom(FilePath.java:798)
	... 16 more
Retrying after 10 seconds
java.io.IOException: Failed to install https://repo.maven.apache.org/maven2/org/apache/maven/apache-maven/3.0.4/apache-maven-3.0.4-bin.zip
to /home/jenkins/tools/maven/apache-maven-3.0.4
	at hudson.FilePath.installIfNecessaryFrom(FilePath.java:832)
	at hudson.tools.DownloadFromUrlInstaller.performInstallation(DownloadFromUrlInstaller.java:75)
	at hudson.tools.InstallerTranslator.getToolHome(InstallerTranslator.java:68)
	at hudson.tools.ToolLocationNodeProperty.getToolHome(ToolLocationNodeProperty.java:108)
	at hudson.tools.ToolInstallation.translateFor(ToolInstallation.java:206)
	at hudson.tasks.Maven$MavenInstallation.forNode(Maven.java:624)
	at hudson.maven.MavenModuleSetBuild.getEnvironment(MavenModuleSetBuild.java:183)
	at hudson.plugins.git.GitSCM.checkout(GitSCM.java:1046)
	at hudson.scm.SCM.checkout(SCM.java:485)
	at hudson.model.AbstractProject.checkout(AbstractProject.java:1276)
	at hudson.model.AbstractBuild$AbstractBuildExecution.defaultCheckout(AbstractBuild.java:607)
	at jenkins.scm.SCMCheckoutStrategy.checkout(SCMCheckoutStrategy.java:86)
	at hudson.model.AbstractBuild$AbstractBuildExecution.run(AbstractBuild.java:529)
	at hudson.model.Run.execute(Run.java:1738)
	at hudson.maven.MavenModuleSetBuild.run(MavenModuleSetBuild.java:531)
	at hudson.model.ResourceController.execute(ResourceController.java:98)
	at hudson.model.Executor.run(Executor.java:410)
Caused by: java.io.IOException: Failed to mkdirs: /home/jenkins/tools/maven/apache-maven-3.0.4
	at hudson.FilePath.mkdirs(FilePath.java:1163)
	at hudson.FilePath.installIfNecessaryFrom(FilePath.java:798)
	... 16 more
Archiving artifacts
ERROR: Failed to archive artifacts: apidocs.bz2
java.io.IOException: Failed to install https://repo.maven.apache.org/maven2/org/apache/maven/apache-maven/3.0.4/apache-maven-3.0.4-bin.zip
to /home/jenkins/tools/maven/apache-maven-3.0.4
	at hudson.FilePath.installIfNecessaryFrom(FilePath.java:832)
	at hudson.tools.DownloadFromUrlInstaller.performInstallation(DownloadFromUrlInstaller.java:75)
	at hudson.tools.InstallerTranslator.getToolHome(InstallerTranslator.java:68)
	at hudson.tools.ToolLocationNodeProperty.getToolHome(ToolLocationNodeProperty.java:108)
	at hudson.tools.ToolInstallation.translateFor(ToolInstallation.java:206)
	at hudson.tasks.Maven$MavenInstallation.forNode(Maven.java:624)
	at hudson.maven.MavenModuleSetBuild.getEnvironment(MavenModuleSetBuild.java:183)
	at hudson.tasks.ArtifactArchiver.perform(ArtifactArchiver.java:232)
	at hudson.tasks.BuildStepCompatibilityLayer.perform(BuildStepCompatibilityLayer.java:78)
	at hudson.tasks.BuildStepMonitor$1.perform(BuildStepMonitor.java:20)
	at hudson.model.AbstractBuild$AbstractBuildExecution.perform(AbstractBuild.java:782)
	at hudson.model.AbstractBuild$AbstractBuildExecution.performAllBuildSteps(AbstractBuild.java:723)
	at hudson.maven.MavenModuleSetBuild$MavenModuleSetBuildExecution.post2(MavenModuleSetBuild.java:1047)
	at hudson.model.AbstractBuild$AbstractBuildExecution.post(AbstractBuild.java:668)
	at hudson.model.Run.execute(Run.java:1763)
	at hudson.maven.MavenModuleSetBuild.run(MavenModuleSetBuild.java:531)
	at hudson.model.ResourceController.execute(ResourceController.java:98)
	at hudson.model.Executor.run(Executor.java:410)
Caused by: java.io.IOException: Failed to mkdirs: /home/jenkins/tools/maven/apache-maven-3.0.4
	at hudson.FilePath.mkdirs(FilePath.java:1163)
	at hudson.FilePath.installIfNecessaryFrom(FilePath.java:798)
	... 17 more

Mime
View raw message