cloudstack-commits mailing list archives

Site index · List index
Message view « Date » · « Thread »
Top « Date » · « Thread »
From Apache Jenkins Server <jenk...@builds.apache.org>
Subject Build failed in Jenkins: cloudstack-apidocs-master #1708
Date Wed, 07 Jan 2015 07:10:58 GMT
See <https://builds.apache.org/job/cloudstack-apidocs-master/1708/changes>

Changes:

[kishan] Trigger user stats aggregation job at midnight in usage aggregation timezone

[kishan] Skip older records which generate negative duration usage

------------------------------------------
[...truncated 855 lines...]
Downloaded: http://repo.maven.apache.org/maven2/javax/ejb/ejb-api/3.0/ejb-api-3.0.pom (149
B at 1.4 KB/sec)
Downloading: http://repo.maven.apache.org/maven2/com/googlecode/java-ipv6/java-ipv6/0.15/java-ipv6-0.15.pom
4/6 KB      
6/6 KB   
         
Downloaded: http://repo.maven.apache.org/maven2/com/googlecode/java-ipv6/java-ipv6/0.15/java-ipv6-0.15.pom
(6 KB at 58.8 KB/sec)
Downloading: http://repo.maven.apache.org/maven2/commons-configuration/commons-configuration/1.10/commons-configuration-1.10.pom
4/21 KB   
8/21 KB   
12/21 KB   
16/21 KB   
20/21 KB   
21/21 KB   
           
Downloaded: http://repo.maven.apache.org/maven2/commons-configuration/commons-configuration/1.10/commons-configuration-1.10.pom
(21 KB at 208.6 KB/sec)
Downloading: http://repo.maven.apache.org/maven2/org/reflections/reflections/0.9.8/reflections-0.9.8.pom
           
Downloaded: http://repo.maven.apache.org/maven2/org/reflections/reflections/0.9.8/reflections-0.9.8.pom
(0 B at 0.0 KB/sec)
Downloading: http://repo.maven.apache.org/maven2/org/reflections/reflections-parent/0.9.8/reflections-parent-0.9.8.pom
           
Downloaded: http://repo.maven.apache.org/maven2/org/reflections/reflections-parent/0.9.8/reflections-parent-0.9.8.pom
(0 B at 0.0 KB/sec)
Downloading: http://repo.maven.apache.org/maven2/com/google/guava/guava/18.0/guava-18.0.pom
           
Downloaded: http://repo.maven.apache.org/maven2/com/google/guava/guava/18.0/guava-18.0.pom
(0 B at 0.0 KB/sec)
Downloading: http://repo.maven.apache.org/maven2/com/google/guava/guava-parent/18.0/guava-parent-18.0.pom
           
Downloaded: http://repo.maven.apache.org/maven2/com/google/guava/guava-parent/18.0/guava-parent-18.0.pom
(0 B at 0.0 KB/sec)
Downloading: http://repo.maven.apache.org/maven2/javassist/javassist/3.12.1.GA/javassist-3.12.1.GA.pom
           
Downloaded: http://repo.maven.apache.org/maven2/javassist/javassist/3.12.1.GA/javassist-3.12.1.GA.pom
(0 B at 0.0 KB/sec)
Downloading: http://repo.maven.apache.org/maven2/org/owasp/esapi/esapi/2.1.0/esapi-2.1.0.pom
           
[WARNING] Failed to create parent directories for resolution tracking file /home/jenkins/.m2/repository/org/owasp/esapi/esapi/2.1.0/esapi-2.1.0.pom.lastUpdated
Downloading: http://repo.maven.apache.org/maven2/org/opensaml/opensaml/2.6.1/opensaml-2.6.1.pom
4/16 KB    
8/16 KB   
12/16 KB   
14/16 KB   
16/16 KB   
           
Downloaded: http://repo.maven.apache.org/maven2/org/opensaml/opensaml/2.6.1/opensaml-2.6.1.pom
(16 KB at 100.0 KB/sec)
Downloading: http://repo.maven.apache.org/maven2/org/opensaml/openws/1.5.1/openws-1.5.1.pom
4/14 KB    
8/14 KB   
12/14 KB   
14/14 KB   
           
Downloaded: http://repo.maven.apache.org/maven2/org/opensaml/openws/1.5.1/openws-1.5.1.pom
(14 KB at 163.1 KB/sec)
Downloading: http://repo.maven.apache.org/maven2/org/opensaml/xmltooling/1.4.1/xmltooling-1.4.1.pom
4/10 KB    
8/10 KB   
10/10 KB   
           
Downloaded: http://repo.maven.apache.org/maven2/org/opensaml/xmltooling/1.4.1/xmltooling-1.4.1.pom
(10 KB at 120.0 KB/sec)
Downloading: http://repo.maven.apache.org/maven2/org/bouncycastle/bcprov-jdk15/1.46/bcprov-jdk15-1.46.pom
819/819 B   
            
Downloaded: http://repo.maven.apache.org/maven2/org/bouncycastle/bcprov-jdk15/1.46/bcprov-jdk15-1.46.pom
(819 B at 10.1 KB/sec)
Downloading: http://repo.maven.apache.org/maven2/ca/juliusdavies/not-yet-commons-ssl/0.3.9/not-yet-commons-ssl-0.3.9.pom
3/3 KB      
         
Downloaded: http://repo.maven.apache.org/maven2/ca/juliusdavies/not-yet-commons-ssl/0.3.9/not-yet-commons-ssl-0.3.9.pom
(3 KB at 27.3 KB/sec)
Downloading: http://repo.maven.apache.org/maven2/commons-net/commons-net/3.3/commons-net-3.3.pom
4/19 KB   
8/19 KB   
12/19 KB   
16/19 KB   
17/19 KB   
19/19 KB   
           
Downloaded: http://repo.maven.apache.org/maven2/commons-net/commons-net/3.3/commons-net-3.3.pom
(19 KB at 161.3 KB/sec)
Downloading: http://repo.maven.apache.org/maven2/org/apache/commons/commons-parent/30/commons-parent-30.pom
4/55 KB    
8/55 KB   
12/55 KB   
16/55 KB   
18/55 KB   
22/55 KB   
26/55 KB   
30/55 KB   
34/55 KB   
38/55 KB   
41/55 KB   
45/55 KB   
49/55 KB   
53/55 KB   
55/55 KB   
           
Downloaded: http://repo.maven.apache.org/maven2/org/apache/commons/commons-parent/30/commons-parent-30.pom
(55 KB at 354.2 KB/sec)
Downloading: http://repository.apache.org/snapshots/org/apache/cloudstack/cloud-framework-config/4.6.0-SNAPSHOT/maven-metadata.xml
           
Downloading: http://repository.apache.org/snapshots/org/apache/cloudstack/cloud-framework-db/4.6.0-SNAPSHOT/maven-metadata.xml
           
Downloading: http://repo.maven.apache.org/maven2/org/eclipse/persistence/javax.persistence/2.1.0/javax.persistence-2.1.0.pom
           
Downloaded: http://repo.maven.apache.org/maven2/org/eclipse/persistence/javax.persistence/2.1.0/javax.persistence-2.1.0.pom
(0 B at 0.0 KB/sec)
Downloading: http://repository.apache.org/snapshots/org/apache/cloudstack/cloud-engine-api/4.6.0-SNAPSHOT/maven-metadata.xml
           
Downloading: http://repo.maven.apache.org/maven2/org/apache/cxf/cxf-bundle-jaxrs/2.7.13/cxf-bundle-jaxrs-2.7.13.pom
4/12 KB    
8/12 KB   
12/12 KB   
12/12 KB   
           
Downloaded: http://repo.maven.apache.org/maven2/org/apache/cxf/cxf-bundle-jaxrs/2.7.13/cxf-bundle-jaxrs-2.7.13.pom
(12 KB at 113.2 KB/sec)
Downloading: http://repo.maven.apache.org/maven2/org/apache/cxf/cxf-bundle-parent/2.7.13/cxf-bundle-parent-2.7.13.pom
4/9 KB     
8/9 KB   
9/9 KB   
         
Downloaded: http://repo.maven.apache.org/maven2/org/apache/cxf/cxf-bundle-parent/2.7.13/cxf-bundle-parent-2.7.13.pom
(9 KB at 107.5 KB/sec)
Downloading: http://repo.maven.apache.org/maven2/org/apache/cxf/cxf-parent/2.7.13/cxf-parent-2.7.13.pom
4/83 KB   
8/83 KB   
12/83 KB   
16/83 KB   
20/83 KB   
24/83 KB   
26/83 KB   
30/83 KB   
34/83 KB   
38/83 KB   
42/83 KB   
46/83 KB   
50/83 KB   
54/83 KB   
54/83 KB   
58/83 KB   
62/83 KB   
66/83 KB   
70/83 KB   
74/83 KB   
78/83 KB   
82/83 KB   
83/83 KB   
           
Downloaded: http://repo.maven.apache.org/maven2/org/apache/cxf/cxf-parent/2.7.13/cxf-parent-2.7.13.pom
(83 KB at 522.6 KB/sec)
Downloading: http://repo.maven.apache.org/maven2/org/apache/cxf/cxf/2.7.13/cxf-2.7.13.pom
4/34 KB    
8/34 KB   
12/34 KB   
16/34 KB   
20/34 KB   
24/34 KB   
28/34 KB   
32/34 KB   
34/34 KB   
           
Downloaded: http://repo.maven.apache.org/maven2/org/apache/cxf/cxf/2.7.13/cxf-2.7.13.pom (34
KB at 408.8 KB/sec)
Downloading: http://repo.maven.apache.org/maven2/org/codehaus/woodstox/woodstox-core-asl/4.4.1/woodstox-core-asl-4.4.1.pom
2/2 KB     
         
Downloaded: http://repo.maven.apache.org/maven2/org/codehaus/woodstox/woodstox-core-asl/4.4.1/woodstox-core-asl-4.4.1.pom
(2 KB at 22.0 KB/sec)
Downloading: http://repository.apache.org/snapshots/org/apache/cloudstack/cloud-framework-rest/4.6.0-SNAPSHOT/maven-metadata.xml
         
Downloading: http://repo.maven.apache.org/maven2/com/fasterxml/jackson/module/jackson-module-jaxb-annotations/2.4.4/jackson-module-jaxb-annotations-2.4.4.pom
4/5 KB   
5/5 KB   
         
Downloaded: http://repo.maven.apache.org/maven2/com/fasterxml/jackson/module/jackson-module-jaxb-annotations/2.4.4/jackson-module-jaxb-annotations-2.4.4.pom
(5 KB at 53.3 KB/sec)
Downloading: http://repo.maven.apache.org/maven2/com/fasterxml/jackson/core/jackson-core/2.4.4/jackson-core-2.4.4.pom
4/5 KB   
5/5 KB   
         
Downloaded: http://repo.maven.apache.org/maven2/com/fasterxml/jackson/core/jackson-core/2.4.4/jackson-core-2.4.4.pom
(5 KB at 52.3 KB/sec)
Downloading: http://repo.maven.apache.org/maven2/com/fasterxml/jackson/core/jackson-databind/2.4.4/jackson-databind-2.4.4.pom
4/6 KB   
6/6 KB   
         
Downloaded: http://repo.maven.apache.org/maven2/com/fasterxml/jackson/core/jackson-databind/2.4.4/jackson-databind-2.4.4.pom
(6 KB at 71.2 KB/sec)
Downloading: http://repo.maven.apache.org/maven2/com/fasterxml/jackson/core/jackson-annotations/2.4.4/jackson-annotations-2.4.4.pom
2/2 KB   
         
Downloaded: http://repo.maven.apache.org/maven2/com/fasterxml/jackson/core/jackson-annotations/2.4.4/jackson-annotations-2.4.4.pom
(2 KB at 14.9 KB/sec)
Downloading: http://repo.maven.apache.org/maven2/com/fasterxml/jackson/jaxrs/jackson-jaxrs-json-provider/2.4.4/jackson-jaxrs-json-provider-2.4.4.pom
4/4 KB   
         
Downloaded: http://repo.maven.apache.org/maven2/com/fasterxml/jackson/jaxrs/jackson-jaxrs-json-provider/2.4.4/jackson-jaxrs-json-provider-2.4.4.pom
(4 KB at 43.0 KB/sec)
Downloading: http://repo.maven.apache.org/maven2/com/fasterxml/jackson/jaxrs/jackson-jaxrs-providers/2.4.4/jackson-jaxrs-providers-2.4.4.pom
4/4 KB   
         
Downloaded: http://repo.maven.apache.org/maven2/com/fasterxml/jackson/jaxrs/jackson-jaxrs-providers/2.4.4/jackson-jaxrs-providers-2.4.4.pom
(4 KB at 47.7 KB/sec)
Downloading: http://repo.maven.apache.org/maven2/com/fasterxml/jackson/jaxrs/jackson-jaxrs-base/2.4.4/jackson-jaxrs-base-2.4.4.pom
2/2 KB   
         
Downloaded: http://repo.maven.apache.org/maven2/com/fasterxml/jackson/jaxrs/jackson-jaxrs-base/2.4.4/jackson-jaxrs-base-2.4.4.pom
(2 KB at 23.8 KB/sec)
Downloading: http://repository.apache.org/snapshots/org/apache/cloudstack/cloud-framework-ipc/4.6.0-SNAPSHOT/maven-metadata.xml
         
Downloading: http://repository.apache.org/snapshots/org/apache/cloudstack/cloud-framework-security/4.6.0-SNAPSHOT/maven-metadata.xml
         
Downloading: http://repository.apache.org/snapshots/org/apache/cloudstack/cloud-framework-cluster/4.6.0-SNAPSHOT/maven-metadata.xml
         
Downloading: http://repository.apache.org/snapshots/org/apache/cloudstack/cloud-framework-jobs/4.6.0-SNAPSHOT/maven-metadata.xml
         
Downloading: http://repository.apache.org/snapshots/org/apache/cloudstack/cloud-framework-events/4.6.0-SNAPSHOT/maven-metadata.xml
         
Downloading: http://repository.apache.org/snapshots/org/apache/cloudstack/cloud-engine-schema/4.6.0-SNAPSHOT/maven-metadata.xml
         
Downloading: http://repo.maven.apache.org/maven2/com/thoughtworks/xstream/xstream/1.4.7/xstream-1.4.7.pom
4/11 KB   
8/11 KB   
11/11 KB   
           
Downloaded: http://repo.maven.apache.org/maven2/com/thoughtworks/xstream/xstream/1.4.7/xstream-1.4.7.pom
(11 KB at 137.2 KB/sec)
Downloading: http://repo.maven.apache.org/maven2/com/thoughtworks/xstream/xstream-parent/1.4.7/xstream-parent-1.4.7.pom
4/26 KB    
8/26 KB   
12/26 KB   
16/26 KB   
20/26 KB   
24/26 KB   
26/26 KB   
           
Downloaded: http://repo.maven.apache.org/maven2/com/thoughtworks/xstream/xstream-parent/1.4.7/xstream-parent-1.4.7.pom
(26 KB at 316.5 KB/sec)
Downloading: http://repository.apache.org/snapshots/org/apache/cloudstack/cloud-engine-components-api/4.6.0-SNAPSHOT/maven-metadata.xml
           
Downloading: http://repo.maven.apache.org/maven2/org/powermock/powermock-api-mockito/1.5.3/powermock-api-mockito-1.5.3.pom
2/2 KB     
         
Downloaded: http://repo.maven.apache.org/maven2/org/powermock/powermock-api-mockito/1.5.3/powermock-api-mockito-1.5.3.pom
(2 KB at 15.1 KB/sec)
Downloading: http://repo.maven.apache.org/maven2/org/powermock/powermock-api/1.5.3/powermock-api-1.5.3.pom
805/805 B   
            
Downloaded: http://repo.maven.apache.org/maven2/org/powermock/powermock-api/1.5.3/powermock-api-1.5.3.pom
(805 B at 10.0 KB/sec)
Downloading: http://repo.maven.apache.org/maven2/org/powermock/powermock-api-support/1.5.3/powermock-api-support-1.5.3.pom
2/2 KB      
         
Downloaded: http://repo.maven.apache.org/maven2/org/powermock/powermock-api-support/1.5.3/powermock-api-support-1.5.3.pom
(2 KB at 15.4 KB/sec)
Downloading: http://repo.maven.apache.org/maven2/org/springframework/spring-test/3.2.12.RELEASE/spring-test-3.2.12.RELEASE.pom
4/7 KB   
7/7 KB   
         
Downloaded: http://repo.maven.apache.org/maven2/org/springframework/spring-test/3.2.12.RELEASE/spring-test-3.2.12.RELEASE.pom
(7 KB at 77.3 KB/sec)
[INFO] ------------------------------------------------------------------------
[INFO] BUILD FAILURE
[INFO] ------------------------------------------------------------------------
[INFO] Total time: 17.704s
[INFO] Finished at: Wed Jan 07 07:10:57 UTC 2015
[INFO] Final Memory: 38M/706M
[INFO] ------------------------------------------------------------------------
[ERROR] Failed to execute goal on project cloud-apidoc: Could not resolve dependencies for
project org.apache.cloudstack:cloud-apidoc:pom:4.6.0-SNAPSHOT: Failed to collect dependencies
for [org.apache.cloudstack:cloud-server:jar:4.6.0-SNAPSHOT (compile), junit:junit:jar:4.11
(test), org.hamcrest:hamcrest-library:jar:1.3 (test), org.mockito:mockito-all:jar:1.9.5 (test),
org.powermock:powermock-module-junit4:jar:1.5.3 (compile), org.powermock:powermock-api-mockito:jar:1.5.3
(test), org.springframework:spring-test:jar:3.2.12.RELEASE (test), javax.inject:javax.inject:jar:1
(compile)]: Failed to read artifact descriptor for org.owasp.esapi:esapi:jar:2.1.0: Could
not transfer artifact org.owasp.esapi:esapi:pom:2.1.0 from/to central (http://repo.maven.apache.org/maven2):
Specified destination directory cannot be created: /home/jenkins/.m2/repository/org/owasp/esapi/esapi/2.1.0
-> [Help 1]
[ERROR] 
[ERROR] To see the full stack trace of the errors, re-run Maven with the -e switch.
[ERROR] Re-run Maven using the -X switch to enable full debug logging.
[ERROR] 
[ERROR] For more information about the errors and possible solutions, please read the following
articles:
[ERROR] [Help 1] http://cwiki.apache.org/confluence/display/MAVEN/DependencyResolutionException
Build step 'Execute shell' marked build as failure
Archiving artifacts

Mime
View raw message