cloudstack-commits mailing list archives

Site index · List index
Message view « Date » · « Thread »
Top « Date » · « Thread »
From Apache Jenkins Server <jenk...@builds.apache.org>
Subject Build failed in Jenkins: cloudstack-marvin #1618
Date Tue, 27 Jan 2015 01:56:10 GMT
See <https://builds.apache.org/job/cloudstack-marvin/1618/>

------------------------------------------
[...truncated 10968 lines...]
755/865 KB   1134/1774 KB   
755/865 KB   1134/1774 KB   
759/865 KB   1134/1774 KB   
763/865 KB   1134/1774 KB   
767/865 KB   1134/1774 KB   
771/865 KB   1134/1774 KB   
775/865 KB   1134/1774 KB   
779/865 KB   1134/1774 KB   
783/865 KB   1134/1774 KB   
787/865 KB   1134/1774 KB   
791/865 KB   1134/1774 KB   
795/865 KB   1134/1774 KB   
799/865 KB   1134/1774 KB   
803/865 KB   1134/1774 KB   
807/865 KB   1134/1774 KB   
811/865 KB   1134/1774 KB   
815/865 KB   1134/1774 KB   
819/865 KB   1134/1774 KB   
823/865 KB   1134/1774 KB   
827/865 KB   1134/1774 KB   
831/865 KB   1134/1774 KB   
835/865 KB   1134/1774 KB   
839/865 KB   1134/1774 KB   
843/865 KB   1134/1774 KB   
847/865 KB   1134/1774 KB   
851/865 KB   1134/1774 KB   
855/865 KB   1134/1774 KB   
859/865 KB   1134/1774 KB   
863/865 KB   1134/1774 KB   
865/865 KB   1134/1774 KB   
865/865 KB   1138/1774 KB   
865/865 KB   1141/1774 KB   
865/865 KB   1145/1774 KB   
865/865 KB   1145/1774 KB   
865/865 KB   1149/1774 KB   
865/865 KB   1153/1774 KB   
865/865 KB   1157/1774 KB   
865/865 KB   1161/1774 KB   
865/865 KB   1164/1774 KB   
865/865 KB   1168/1774 KB   
865/865 KB   1172/1774 KB   
865/865 KB   1176/1774 KB   
865/865 KB   1179/1774 KB   
865/865 KB   1183/1774 KB   
865/865 KB   1185/1774 KB   
865/865 KB   1189/1774 KB   
865/865 KB   1192/1774 KB   
865/865 KB   1196/1774 KB   
865/865 KB   1200/1774 KB   
865/865 KB   1204/1774 KB   
865/865 KB   1208/1774 KB   
865/865 KB   1212/1774 KB   
865/865 KB   1213/1774 KB   
                            
Downloaded: http://repo.maven.apache.org/maven2/org/springframework/spring-core/3.2.12.RELEASE/spring-core-3.2.12.RELEASE.jar
(865 KB at 3054.7 KB/sec)
1217/1774 KB                
1219/1774 KB   
1223/1774 KB   
1225/1774 KB   
1227/1774 KB   
1231/1774 KB   
1235/1774 KB   
1239/1774 KB   
1240/1774 KB   
1243/1774 KB   
1247/1774 KB   
1251/1774 KB   
1254/1774 KB   
1258/1774 KB   
1259/1774 KB   
1263/1774 KB   
1264/1774 KB   
1268/1774 KB   
1271/1774 KB   
1275/1774 KB   
1279/1774 KB   
1283/1774 KB   
1287/1774 KB   
1291/1774 KB   
1293/1774 KB   
1297/1774 KB   
1298/1774 KB   
1302/1774 KB   
1304/1774 KB   
1307/1774 KB   
1311/1774 KB   
1315/1774 KB   
1319/1774 KB   
1322/1774 KB   
1326/1774 KB   
1326/1774 KB   
1330/1774 KB   
1334/1774 KB   
1338/1774 KB   
1342/1774 KB   
1346/1774 KB   
1350/1774 KB   
1351/1774 KB   
1355/1774 KB   
1359/1774 KB   
1363/1774 KB   
1367/1774 KB   
1371/1774 KB   
1372/1774 KB   
1376/1774 KB   
1379/1774 KB   
1383/1774 KB   
1384/1774 KB   
1387/1774 KB   
1391/1774 KB   
1395/1774 KB   
1399/1774 KB   
1403/1774 KB   
1407/1774 KB   
1410/1774 KB   
1414/1774 KB   
1414/1774 KB   
1418/1774 KB   
1422/1774 KB   
1426/1774 KB   
1430/1774 KB   
1433/1774 KB   
1437/1774 KB   
1441/1774 KB   
1445/1774 KB   
1449/1774 KB   
1452/1774 KB   
1456/1774 KB   
1459/1774 KB   
1463/1774 KB   
1465/1774 KB   
1468/1774 KB   
1472/1774 KB   
1476/1774 KB   
1480/1774 KB   
1484/1774 KB   
1488/1774 KB   
1490/1774 KB   
1494/1774 KB   
1495/1774 KB   
1499/1774 KB   
1503/1774 KB   
1507/1774 KB   
1510/1774 KB   
1513/1774 KB   
1517/1774 KB   
1520/1774 KB   
1524/1774 KB   
1528/1774 KB   
1532/1774 KB   
1536/1774 KB   
1540/1774 KB   
1540/1774 KB   
1544/1774 KB   
1546/1774 KB   
1548/1774 KB   
1552/1774 KB   
1554/1774 KB   
1558/1774 KB   
1562/1774 KB   
1566/1774 KB   
1570/1774 KB   
1574/1774 KB   
1575/1774 KB   
1577/1774 KB   
1581/1774 KB   
1585/1774 KB   
1589/1774 KB   
1593/1774 KB   
1594/1774 KB   
1598/1774 KB   
1601/1774 KB   
1605/1774 KB   
1609/1774 KB   
1612/1774 KB   
1616/1774 KB   
1620/1774 KB   
1621/1774 KB   
1623/1774 KB   
1626/1774 KB   
1629/1774 KB   
1633/1774 KB   
1635/1774 KB   
1639/1774 KB   
1643/1774 KB   
1647/1774 KB   
1651/1774 KB   
1652/1774 KB   
1656/1774 KB   
1656/1774 KB   
1660/1774 KB   
1664/1774 KB   
1668/1774 KB   
1672/1774 KB   
1674/1774 KB   
1678/1774 KB   
1681/1774 KB   
1685/1774 KB   
1688/1774 KB   
1692/1774 KB   
1693/1774 KB   
1697/1774 KB   
1700/1774 KB   
1701/1774 KB   
1705/1774 KB   
1707/1774 KB   
1710/1774 KB   
1714/1774 KB   
1715/1774 KB   
1717/1774 KB   
1721/1774 KB   
1725/1774 KB   
1729/1774 KB   
1733/1774 KB   
1737/1774 KB   
1741/1774 KB   
1745/1774 KB   
1749/1774 KB   
1752/1774 KB   
1755/1774 KB   
1759/1774 KB   
1763/1774 KB   
1767/1774 KB   
1771/1774 KB   
1773/1774 KB   
1774/1774 KB   
               
Downloaded: http://repo.maven.apache.org/maven2/org/bouncycastle/bcprov-jdk15/1.46/bcprov-jdk15-1.46.jar
(1774 KB at 2008.1 KB/sec)
[INFO] ------------------------------------------------------------------------
[INFO] Reactor Summary:
[INFO] 
[INFO] Apache CloudStack apidocs ......................... FAILURE [18.394s]
[INFO] Apache CloudStack marvin .......................... SKIPPED
[INFO] ------------------------------------------------------------------------
[INFO] BUILD FAILURE
[INFO] ------------------------------------------------------------------------
[INFO] Total time: 20.882s
[INFO] Finished at: Tue Jan 27 01:56:09 UTC 2015
[INFO] Final Memory: 38M/705M
[INFO] ------------------------------------------------------------------------
[ERROR] Failed to execute goal on project cloud-apidoc: Could not resolve dependencies for
project org.apache.cloudstack:cloud-apidoc:pom:4.6.0-SNAPSHOT: The following artifacts could
not be resolved: org.apache.cloudstack:cloud-server:jar:4.6.0-SNAPSHOT, org.apache.cloudstack:cloud-core:jar:4.6.0-SNAPSHOT,
org.apache.cloudstack:cloud-engine-api:jar:4.6.0-SNAPSHOT, org.apache.cloudstack:cloud-framework-rest:jar:4.6.0-SNAPSHOT,
org.apache.cloudstack:cloud-framework-cluster:jar:4.6.0-SNAPSHOT, org.apache.cloudstack:cloud-framework-db:jar:4.6.0-SNAPSHOT,
org.apache.cloudstack:cloud-framework-security:jar:4.6.0-SNAPSHOT, org.apache.cloudstack:cloud-framework-jobs:jar:4.6.0-SNAPSHOT,
org.apache.cloudstack:cloud-utils:jar:4.6.0-SNAPSHOT, org.apache.cloudstack:cloud-framework-managed-context:jar:4.6.0-SNAPSHOT,
org.apache.cloudstack:cloud-api:jar:4.6.0-SNAPSHOT, org.apache.cloudstack:cloud-engine-schema:jar:4.6.0-SNAPSHOT,
org.apache.cloudstack:cloud-framework-ipc:jar:4.6.0-SNAPSHOT, org.apache.cloudstack:cloud-framework-events:jar:4.6.0-SNAPSHOT,
org.apache.cloudstack:cloud-framework-config:jar:4.6.0-SNAPSHOT, org.apache.cloudstack:cloud-engine-components-api:jar:4.6.0-SNAPSHOT:
Could not find artifact org.apache.cloudstack:cloud-server:jar:4.6.0-SNAPSHOT in Nexus (http://repository.apache.org/snapshots)
-> [Help 1]
[ERROR] 
[ERROR] To see the full stack trace of the errors, re-run Maven with the -e switch.
[ERROR] Re-run Maven using the -X switch to enable full debug logging.
[ERROR] 
[ERROR] For more information about the errors and possible solutions, please read the following
articles:
[ERROR] [Help 1] http://cwiki.apache.org/confluence/display/MAVEN/DependencyResolutionException
Build step 'Execute shell' marked build as failure
Archiving artifacts

Mime
View raw message