cloudstack-commits mailing list archives

Site index · List index
Message view « Date » · « Thread »
Top « Date » · « Thread »
From Apache Jenkins Server <jenk...@builds.apache.org>
Subject Build failed in Jenkins: cloudstack-marvin #1585
Date Wed, 14 Jan 2015 15:44:57 GMT
See <https://builds.apache.org/job/cloudstack-marvin/1585/changes>

Changes:

[pyr] Use constant-time comparison functions when checking signatures

[pyr] move ConstantTimeComparator to utils

[terbolous] Add absolute schema references to support MySQL 5.6 better

------------------------------------------
[...truncated 331 lines...]
[INFO] Apache CloudStack Plugin - Dns Notifier Example ... SKIPPED
[INFO] Apache CloudStack Plugin - Storage Image S3 ....... SKIPPED
[INFO] Apache CloudStack Plugin - Storage Image Swift provider  SKIPPED
[INFO] Apache CloudStack Plugin - Storage Image default provider  SKIPPED
[INFO] Apache CloudStack Plugin - Storage Image sample provider  SKIPPED
[INFO] Apache CloudStack Plugin - Storage Volume Nexenta Provider  SKIPPED
[INFO] Apache CloudStack Plugin - Storage Volume CloudByte Provider  SKIPPED
[INFO] Apache CloudStack Plugin - Storage Volume sample provider  SKIPPED
[INFO] Apache CloudStack Plugin - SNMP Alerts ............ SKIPPED
[INFO] Apache CloudStack Plugin - Syslog Alerts .......... SKIPPED
[INFO] Apache CloudStack Plugin - Network VXLAN .......... SKIPPED
[INFO] Apache CloudStack Plugin - GloboDNS ............... SKIPPED
[INFO] Apache CloudStack Framework - Spring Module ....... SKIPPED
[INFO] Apache CloudStack Secondary Storage Controller .... SKIPPED
[INFO] Apache CloudStack Client UI ....................... SKIPPED
[INFO] Apache CloudStack Console Proxy - RDP Client ...... SKIPPED
[INFO] Apache CloudStack Console Proxy ................... SKIPPED
[INFO] Apache CloudStack Console Proxy - Server .......... SKIPPED
[INFO] Apache CloudStack Framework - QuickCloud .......... SKIPPED
[INFO] ------------------------------------------------------------------------
[INFO] BUILD FAILURE
[INFO] ------------------------------------------------------------------------
[INFO] Total time: 11.939s
[INFO] Finished at: Wed Jan 14 15:44:17 UTC 2015
[INFO] Final Memory: 45M/439M
[INFO] ------------------------------------------------------------------------
[JENKINS] Archiving disabled
[JENKINS] Archiving disabled
[JENKINS] Archiving disabled
[JENKINS] Archiving disabled
[JENKINS] Archiving disabled
[JENKINS] Archiving disabled
[JENKINS] Archiving disabled
[JENKINS] Archiving disabled
[JENKINS] Archiving disabled
[JENKINS] Archiving disabled
[JENKINS] Archiving disabled
[JENKINS] Archiving disabled
[JENKINS] Archiving disabled
[JENKINS] Archiving disabled
[JENKINS] Archiving disabled
[JENKINS] Archiving disabled
[JENKINS] Archiving disabled
[JENKINS] Archiving disabled
[JENKINS] Archiving disabled
[JENKINS] Archiving disabled
[JENKINS] Archiving disabled
[JENKINS] Archiving disabled
[JENKINS] Archiving disabled
[JENKINS] Archiving disabled
[JENKINS] Archiving disabled
[JENKINS] Archiving disabled
[JENKINS] Archiving disabled
[JENKINS] Archiving disabled
[JENKINS] Archiving disabled
[JENKINS] Archiving disabled
[JENKINS] Archiving disabled
[JENKINS] Archiving disabled
[JENKINS] Archiving disabled
[JENKINS] Archiving disabled
[JENKINS] Archiving disabled
[JENKINS] Archiving disabled
[JENKINS] Archiving disabled
[JENKINS] Archiving disabled
[JENKINS] Archiving disabled
[JENKINS] Archiving disabled
[JENKINS] Archiving disabled
[JENKINS] Archiving disabled
[JENKINS] Archiving disabled
[JENKINS] Archiving disabled
[JENKINS] Archiving disabled
[JENKINS] Archiving disabled
[JENKINS] Archiving disabled
[JENKINS] Archiving disabled
[JENKINS] Archiving disabled
[JENKINS] Archiving disabled
[JENKINS] Archiving disabled
[JENKINS] Archiving disabled
[JENKINS] Archiving disabled
[JENKINS] Archiving disabled
[JENKINS] Archiving disabled
[JENKINS] Archiving disabled
[JENKINS] Archiving disabled
[JENKINS] Archiving disabled
[JENKINS] Archiving disabled
[JENKINS] Archiving disabled
[JENKINS] Archiving disabled
[JENKINS] Archiving disabled
[JENKINS] Archiving disabled
[JENKINS] Archiving disabled
[JENKINS] Archiving disabled
[JENKINS] Archiving disabled
[JENKINS] Archiving disabled
[JENKINS] Archiving disabled
[JENKINS] Archiving disabled
[JENKINS] Archiving disabled
[JENKINS] Archiving disabled
[JENKINS] Archiving disabled
[JENKINS] Archiving disabled
[JENKINS] Archiving disabled
[JENKINS] Archiving disabled
[JENKINS] Archiving disabled
[JENKINS] Archiving disabled
[JENKINS] Archiving disabled
[JENKINS] Archiving disabled
[JENKINS] Archiving disabled
[JENKINS] Archiving disabled
[JENKINS] Archiving disabled
[JENKINS] Archiving disabled
[JENKINS] Archiving disabled
[JENKINS] Archiving disabled
[JENKINS] Archiving disabled
[JENKINS] Archiving disabled
[JENKINS] Archiving disabled
[JENKINS] Archiving disabled
[JENKINS] Archiving disabled
[JENKINS] Archiving disabled
[JENKINS] Archiving disabled
[JENKINS] Archiving disabled
[JENKINS] Archiving disabled
[JENKINS] Archiving disabled
[JENKINS] Archiving disabled
Waiting for Jenkins to finish collecting data[ERROR] Failed to execute goal org.apache.maven.plugins:maven-compiler-plugin:3.2:compile
(default-compile) on project cloud-framework-managed-context: Compilation failure
[ERROR] javac: invalid target release: 1.7
[ERROR] Usage: javac <options> <source files>
[ERROR] use -help for a list of possible options
[ERROR] -> [Help 1]
[ERROR] 
[ERROR] To see the full stack trace of the errors, re-run Maven with the -e switch.
[ERROR] Re-run Maven using the -X switch to enable full debug logging.
[ERROR] 
[ERROR] For more information about the errors and possible solutions, please read the following
articles:
[ERROR] [Help 1] http://cwiki.apache.org/confluence/display/MAVEN/MojoFailureException
[ERROR] 
[ERROR] After correcting the problems, you can resume the build with the command
[ERROR]   mvn <goals> -rf :cloud-framework-managed-context

channel stopped
[cloudstack-marvin] $ /bin/bash -xe /tmp/hudson2006173319661766753.sh
+ mvn -P developer -pl :cloud-apidoc -pl :cloud-marvin
[INFO] Scanning for projects...
[WARNING] 
[WARNING] Some problems were encountered while building the effective model for org.apache.cloudstack:cloud-plugin-hypervisor-hyperv:jar:4.6.0-SNAPSHOT
[WARNING] 'build.plugins.plugin.version' for org.codehaus.mojo:exec-maven-plugin is missing.
@ line 70, column 15
[WARNING] 
[WARNING] It is highly recommended to fix these problems because they threaten the stability
of your build.
[WARNING] 
[WARNING] For this reason, future Maven versions might no longer support building such malformed
projects.
[WARNING] 
[INFO] ------------------------------------------------------------------------
[INFO] Reactor Build Order:
[INFO] 
[INFO] Apache CloudStack apidocs
[INFO] Apache CloudStack marvin
[INFO]                                                                         
[INFO] ------------------------------------------------------------------------
[INFO] Building Apache CloudStack apidocs 4.6.0-SNAPSHOT
[INFO] ------------------------------------------------------------------------
Downloading: http://repository.apache.org/snapshots/org/apache/cloudstack/cloud-server/4.6.0-SNAPSHOT/maven-metadata.xml

Downloading: http://repository.apache.org/snapshots/org/apache/cloudstack/cloud-core/4.6.0-SNAPSHOT/maven-metadata.xml

Downloading: http://repository.apache.org/snapshots/org/apache/cloudstack/cloud-api/4.6.0-SNAPSHOT/maven-metadata.xml

Downloading: http://repository.apache.org/snapshots/org/apache/cloudstack/cloud-utils/4.6.0-SNAPSHOT/maven-metadata.xml

Downloading: http://repository.apache.org/snapshots/org/apache/cloudstack/cloud-framework-managed-context/4.6.0-SNAPSHOT/maven-metadata.xml

Downloading: http://repository.apache.org/snapshots/joda-time/joda-time/maven-metadata.xml
Downloading: http://repo.maven.apache.org/maven2/joda-time/joda-time/maven-metadata.xml

931/931 B   
            
Downloaded: http://repo.maven.apache.org/maven2/joda-time/joda-time/maven-metadata.xml (931
B at 4.8 KB/sec)
Downloading: http://repository.apache.org/snapshots/org/apache/cloudstack/cloud-framework-config/4.6.0-SNAPSHOT/maven-metadata.xml
            
Downloading: http://repository.apache.org/snapshots/org/apache/cloudstack/cloud-framework-db/4.6.0-SNAPSHOT/maven-metadata.xml
            
Downloading: http://repository.apache.org/snapshots/org/apache/cloudstack/cloud-engine-api/4.6.0-SNAPSHOT/maven-metadata.xml
            
Downloading: http://repository.apache.org/snapshots/org/apache/cloudstack/cloud-framework-rest/4.6.0-SNAPSHOT/maven-metadata.xml
            
Downloading: http://repository.apache.org/snapshots/org/apache/cloudstack/cloud-framework-ipc/4.6.0-SNAPSHOT/maven-metadata.xml
            
Downloading: http://repository.apache.org/snapshots/org/apache/cloudstack/cloud-framework-security/4.6.0-SNAPSHOT/maven-metadata.xml
            
Downloading: http://repository.apache.org/snapshots/org/apache/cloudstack/cloud-framework-cluster/4.6.0-SNAPSHOT/maven-metadata.xml
            
Downloading: http://repository.apache.org/snapshots/org/apache/cloudstack/cloud-framework-jobs/4.6.0-SNAPSHOT/maven-metadata.xml
            
Downloading: http://repository.apache.org/snapshots/org/apache/cloudstack/cloud-framework-events/4.6.0-SNAPSHOT/maven-metadata.xml
            
Downloading: http://repository.apache.org/snapshots/org/apache/cloudstack/cloud-engine-schema/4.6.0-SNAPSHOT/maven-metadata.xml
            
Downloading: http://repository.apache.org/snapshots/org/apache/cloudstack/cloud-engine-components-api/4.6.0-SNAPSHOT/maven-metadata.xml
            
Downloading: http://repository.apache.org/snapshots/org/apache/cloudstack/cloud-server/4.6.0-SNAPSHOT/cloud-server-4.6.0-SNAPSHOT.jar
Downloading: http://repository.apache.org/snapshots/org/apache/cloudstack/cloud-core/4.6.0-SNAPSHOT/cloud-core-4.6.0-SNAPSHOT.jar
Downloading: http://repository.apache.org/snapshots/org/apache/cloudstack/cloud-engine-api/4.6.0-SNAPSHOT/cloud-engine-api-4.6.0-SNAPSHOT.jar
Downloading: http://repository.apache.org/snapshots/org/apache/cloudstack/cloud-framework-rest/4.6.0-SNAPSHOT/cloud-framework-rest-4.6.0-SNAPSHOT.jar
Downloading: http://repository.apache.org/snapshots/org/apache/cloudstack/cloud-framework-cluster/4.6.0-SNAPSHOT/cloud-framework-cluster-4.6.0-SNAPSHOT.jar
            
Downloading: http://repository.apache.org/snapshots/org/apache/cloudstack/cloud-framework-db/4.6.0-SNAPSHOT/cloud-framework-db-4.6.0-SNAPSHOT.jar
            
Downloading: http://repository.apache.org/snapshots/org/apache/cloudstack/cloud-framework-security/4.6.0-SNAPSHOT/cloud-framework-security-4.6.0-SNAPSHOT.jar
            
            
Downloading: http://repository.apache.org/snapshots/org/apache/cloudstack/cloud-framework-jobs/4.6.0-SNAPSHOT/cloud-framework-jobs-4.6.0-SNAPSHOT.jar
Downloading: http://repository.apache.org/snapshots/org/apache/cloudstack/cloud-utils/4.6.0-SNAPSHOT/cloud-utils-4.6.0-SNAPSHOT.jar
            
Downloading: http://repository.apache.org/snapshots/org/apache/cloudstack/cloud-framework-managed-context/4.6.0-SNAPSHOT/cloud-framework-managed-context-4.6.0-SNAPSHOT.jar
            
Downloading: http://repository.apache.org/snapshots/org/apache/cloudstack/cloud-api/4.6.0-SNAPSHOT/cloud-api-4.6.0-SNAPSHOT.jar
            
Downloading: http://repository.apache.org/snapshots/org/apache/cloudstack/cloud-engine-schema/4.6.0-SNAPSHOT/cloud-engine-schema-4.6.0-SNAPSHOT.jar
            
Downloading: http://repository.apache.org/snapshots/org/apache/cloudstack/cloud-framework-ipc/4.6.0-SNAPSHOT/cloud-framework-ipc-4.6.0-SNAPSHOT.jar
            
Downloading: http://repository.apache.org/snapshots/org/apache/cloudstack/cloud-framework-events/4.6.0-SNAPSHOT/cloud-framework-events-4.6.0-SNAPSHOT.jar
            
Downloading: http://repository.apache.org/snapshots/org/apache/cloudstack/cloud-framework-config/4.6.0-SNAPSHOT/cloud-framework-config-4.6.0-SNAPSHOT.jar
            
            
Downloading: http://repository.apache.org/snapshots/org/apache/cloudstack/cloud-engine-components-api/4.6.0-SNAPSHOT/cloud-engine-components-api-4.6.0-SNAPSHOT.jar
            
            
            
            
[INFO] ------------------------------------------------------------------------
[INFO] Reactor Summary:
[INFO] 
[INFO] Apache CloudStack apidocs ......................... FAILURE [6.407s]
[INFO] Apache CloudStack marvin .......................... SKIPPED
[INFO] ------------------------------------------------------------------------
[INFO] BUILD FAILURE
[INFO] ------------------------------------------------------------------------
[INFO] Total time: 8.747s
[INFO] Finished at: Wed Jan 14 15:44:56 UTC 2015
[INFO] Final Memory: 36M/309M
[INFO] ------------------------------------------------------------------------
[ERROR] Failed to execute goal on project cloud-apidoc: Could not resolve dependencies for
project org.apache.cloudstack:cloud-apidoc:pom:4.6.0-SNAPSHOT: The following artifacts could
not be resolved: org.apache.cloudstack:cloud-server:jar:4.6.0-SNAPSHOT, org.apache.cloudstack:cloud-core:jar:4.6.0-SNAPSHOT,
org.apache.cloudstack:cloud-engine-api:jar:4.6.0-SNAPSHOT, org.apache.cloudstack:cloud-framework-rest:jar:4.6.0-SNAPSHOT,
org.apache.cloudstack:cloud-framework-cluster:jar:4.6.0-SNAPSHOT, org.apache.cloudstack:cloud-framework-db:jar:4.6.0-SNAPSHOT,
org.apache.cloudstack:cloud-framework-security:jar:4.6.0-SNAPSHOT, org.apache.cloudstack:cloud-framework-jobs:jar:4.6.0-SNAPSHOT,
org.apache.cloudstack:cloud-utils:jar:4.6.0-SNAPSHOT, org.apache.cloudstack:cloud-framework-managed-context:jar:4.6.0-SNAPSHOT,
org.apache.cloudstack:cloud-api:jar:4.6.0-SNAPSHOT, org.apache.cloudstack:cloud-engine-schema:jar:4.6.0-SNAPSHOT,
org.apache.cloudstack:cloud-framework-ipc:jar:4.6.0-SNAPSHOT, org.apache.cloudstack:cloud-framework-events:jar:4.6.0-SNAPSHOT,
org.apache.cloudstack:cloud-framework-config:jar:4.6.0-SNAPSHOT, org.apache.cloudstack:cloud-engine-components-api:jar:4.6.0-SNAPSHOT:
Could not find artifact org.apache.cloudstack:cloud-server:jar:4.6.0-SNAPSHOT in Nexus (http://repository.apache.org/snapshots)
-> [Help 1]
[ERROR] 
[ERROR] To see the full stack trace of the errors, re-run Maven with the -e switch.
[ERROR] Re-run Maven using the -X switch to enable full debug logging.
[ERROR] 
[ERROR] For more information about the errors and possible solutions, please read the following
articles:
[ERROR] [Help 1] http://cwiki.apache.org/confluence/display/MAVEN/DependencyResolutionException
Build step 'Execute shell' marked build as failure
Archiving artifacts

Mime
View raw message