cloudstack-commits mailing list archives

Site index · List index
Message view « Date » · « Thread »
Top « Date » · « Thread »
From Apache Jenkins Server <jenk...@builds.apache.org>
Subject Build failed in Jenkins: cloudstack-marvin #1606
Date Fri, 23 Jan 2015 05:23:00 GMT
See <https://builds.apache.org/job/cloudstack-marvin/1606/changes>

Changes:

[brian.federle] Reduce size of 'select view' dropdown to fix more dense toolbars.

[mike.tutkowski] Un-plug any remaining VBDs and PBDs

------------------------------------------
[...truncated 316 lines...]
[INFO] Apache CloudStack Plugin - Network Internal Load Balancer  SKIPPED
[INFO] Apache CloudStack Framework - Spring Life Cycle ... SKIPPED
[INFO] Apache CloudStack Plugin - Network Juniper Contrail  SKIPPED
[INFO] Apache CloudStack Plugin - Palo Alto .............. SKIPPED
[INFO] Apache CloudStack Plugin - Network Netscaler ...... SKIPPED
[INFO] Apache CloudStack Plugin - Network Nicira NVP ..... SKIPPED
[INFO] Apache CloudStack Plugin - BigSwitch Virtual Network Segment  SKIPPED
[INFO] Apache CloudStack Plugin - Network Brocade VCS .... SKIPPED
[INFO] Apache CloudStack Plugin - Midokura Midonet ....... SKIPPED
[INFO] Apache CloudStack Plugin - Stratosphere SSP ....... SKIPPED
[INFO] Apache CloudStack Plugin - Network Opendaylight ... SKIPPED
[INFO] Apache CloudStack Plugin - Storage Allocator Random  SKIPPED
[INFO] Apache CloudStack Plugin - User Authenticator LDAP  SKIPPED
[INFO] Apache CloudStack Plugin - User Authenticator MD5 . SKIPPED
[INFO] Apache CloudStack Plugin - User Authenticator Plain Text  SKIPPED
[INFO] Apache CloudStack Plugin - User Authenticator SAML2  SKIPPED
[INFO] Apache CloudStack Plugin - User Authenticator SHA256 Salted  SKIPPED
[INFO] Apache CloudStack Plugin - Dns Notifier Example ... SKIPPED
[INFO] Apache CloudStack Plugin - Storage Image S3 ....... SKIPPED
[INFO] Apache CloudStack Plugin - Storage Image Swift provider  SKIPPED
[INFO] Apache CloudStack Plugin - Storage Image default provider  SKIPPED
[INFO] Apache CloudStack Plugin - Storage Image sample provider  SKIPPED
[INFO] Apache CloudStack Plugin - Storage Volume Nexenta Provider  SKIPPED
[INFO] Apache CloudStack Plugin - Storage Volume CloudByte Provider  SKIPPED
[INFO] Apache CloudStack Plugin - Storage Volume sample provider  SKIPPED
[INFO] Apache CloudStack Plugin - SNMP Alerts ............ SKIPPED
[INFO] Apache CloudStack Plugin - Syslog Alerts .......... SKIPPED
[INFO] Apache CloudStack Plugin - Network VXLAN .......... SKIPPED
[INFO] Apache CloudStack Plugin - GloboDNS ............... SKIPPED
[INFO] Apache CloudStack Framework - Spring Module ....... SKIPPED
[INFO] Apache CloudStack Secondary Storage Controller .... SKIPPED
[INFO] Apache CloudStack Client UI ....................... SKIPPED
[INFO] Apache CloudStack Console Proxy - RDP Client ...... SKIPPED
[INFO] Apache CloudStack Console Proxy ................... SKIPPED
[INFO] Apache CloudStack Console Proxy - Server .......... SKIPPED
[INFO] Apache CloudStack Framework - QuickCloud .......... SKIPPED
[INFO] ------------------------------------------------------------------------
[INFO] BUILD FAILURE
[INFO] ------------------------------------------------------------------------
[INFO] Total time: 9.273s
[INFO] Finished at: Fri Jan 23 05:22:31 UTC 2015
[INFO] Final Memory: 45M/439M
[INFO] ------------------------------------------------------------------------
[JENKINS] Archiving disabled
[JENKINS] Archiving disabled
[JENKINS] Archiving disabled
[JENKINS] Archiving disabled
[JENKINS] Archiving disabled
[JENKINS] Archiving disabled
[JENKINS] Archiving disabled
[JENKINS] Archiving disabled
[JENKINS] Archiving disabled
[JENKINS] Archiving disabled
[JENKINS] Archiving disabled
[JENKINS] Archiving disabled
[JENKINS] Archiving disabled
[JENKINS] Archiving disabled
[JENKINS] Archiving disabled
[JENKINS] Archiving disabled
[JENKINS] Archiving disabled
[JENKINS] Archiving disabled
[JENKINS] Archiving disabled
[JENKINS] Archiving disabled
[JENKINS] Archiving disabled
[JENKINS] Archiving disabled
[JENKINS] Archiving disabled
[JENKINS] Archiving disabled
[JENKINS] Archiving disabled
[JENKINS] Archiving disabled
[JENKINS] Archiving disabled
[JENKINS] Archiving disabled
[JENKINS] Archiving disabled
[JENKINS] Archiving disabled
[JENKINS] Archiving disabled
[JENKINS] Archiving disabled
[JENKINS] Archiving disabled
[JENKINS] Archiving disabled
[JENKINS] Archiving disabled
[JENKINS] Archiving disabled
[JENKINS] Archiving disabled
[JENKINS] Archiving disabled
[JENKINS] Archiving disabled
[JENKINS] Archiving disabled
[JENKINS] Archiving disabled
[JENKINS] Archiving disabled
[JENKINS] Archiving disabled
[JENKINS] Archiving disabled
[JENKINS] Archiving disabled
[JENKINS] Archiving disabled
[JENKINS] Archiving disabled
[JENKINS] Archiving disabled
[JENKINS] Archiving disabled
[JENKINS] Archiving disabled
[JENKINS] Archiving disabled
[JENKINS] Archiving disabled
[JENKINS] Archiving disabled
[JENKINS] Archiving disabled
[JENKINS] Archiving disabled
[JENKINS] Archiving disabled
[JENKINS] Archiving disabled
[JENKINS] Archiving disabled
[JENKINS] Archiving disabled
[JENKINS] Archiving disabled
[JENKINS] Archiving disabled
[JENKINS] Archiving disabled
[JENKINS] Archiving disabled
[JENKINS] Archiving disabled
[JENKINS] Archiving disabled
[JENKINS] Archiving disabled
[JENKINS] Archiving disabled
[JENKINS] Archiving disabled
[JENKINS] Archiving disabled
[JENKINS] Archiving disabled
[JENKINS] Archiving disabled
[JENKINS] Archiving disabled
[JENKINS] Archiving disabled
[JENKINS] Archiving disabled
[JENKINS] Archiving disabled
[JENKINS] Archiving disabled
[JENKINS] Archiving disabled
[JENKINS] Archiving disabled
[JENKINS] Archiving disabled
[JENKINS] Archiving disabled
[JENKINS] Archiving disabled
[JENKINS] Archiving disabled
[JENKINS] Archiving disabled
[JENKINS] Archiving disabled
[JENKINS] Archiving disabled
[JENKINS] Archiving disabled
[JENKINS] Archiving disabled
[JENKINS] Archiving disabled
[JENKINS] Archiving disabled
[JENKINS] Archiving disabled
[JENKINS] Archiving disabled
[JENKINS] Archiving disabled
[JENKINS] Archiving disabled
[JENKINS] Archiving disabled
[JENKINS] Archiving disabled
[JENKINS] Archiving disabled
Waiting for Jenkins to finish collecting data[ERROR] Failed to execute goal org.apache.maven.plugins:maven-compiler-plugin:3.2:compile
(default-compile) on project cloud-framework-managed-context: Compilation failure
[ERROR] javac: invalid target release: 1.7
[ERROR] Usage: javac <options> <source files>
[ERROR] use -help for a list of possible options
[ERROR] -> [Help 1]
[ERROR] 
[ERROR] To see the full stack trace of the errors, re-run Maven with the -e switch.
[ERROR] Re-run Maven using the -X switch to enable full debug logging.
[ERROR] 
[ERROR] For more information about the errors and possible solutions, please read the following
articles:
[ERROR] [Help 1] http://cwiki.apache.org/confluence/display/MAVEN/MojoFailureException
[ERROR] 
[ERROR] After correcting the problems, you can resume the build with the command
[ERROR]   mvn <goals> -rf :cloud-framework-managed-context

channel stopped
[cloudstack-marvin] $ /bin/bash -xe /tmp/hudson3702043490684741285.sh
+ mvn -P developer -pl :cloud-apidoc -pl :cloud-marvin
[INFO] Scanning for projects...
[WARNING] 
[WARNING] Some problems were encountered while building the effective model for org.apache.cloudstack:cloud-plugin-hypervisor-hyperv:jar:4.6.0-SNAPSHOT
[WARNING] 'build.plugins.plugin.version' for org.codehaus.mojo:exec-maven-plugin is missing.
@ line 70, column 15
[WARNING] 
[WARNING] It is highly recommended to fix these problems because they threaten the stability
of your build.
[WARNING] 
[WARNING] For this reason, future Maven versions might no longer support building such malformed
projects.
[WARNING] 
[INFO] ------------------------------------------------------------------------
[INFO] Reactor Build Order:
[INFO] 
[INFO] Apache CloudStack apidocs
[INFO] Apache CloudStack marvin
[INFO]                                                                         
[INFO] ------------------------------------------------------------------------
[INFO] Building Apache CloudStack apidocs 4.6.0-SNAPSHOT
[INFO] ------------------------------------------------------------------------
Downloading: http://repository.apache.org/snapshots/org/apache/cloudstack/cloud-server/4.6.0-SNAPSHOT/maven-metadata.xml

Downloading: http://repository.apache.org/snapshots/org/apache/cloudstack/cloud-core/4.6.0-SNAPSHOT/maven-metadata.xml

Downloading: http://repository.apache.org/snapshots/org/apache/cloudstack/cloud-api/4.6.0-SNAPSHOT/maven-metadata.xml

Downloading: http://repository.apache.org/snapshots/org/apache/cloudstack/cloud-utils/4.6.0-SNAPSHOT/maven-metadata.xml

Downloading: http://repository.apache.org/snapshots/org/apache/cloudstack/cloud-framework-managed-context/4.6.0-SNAPSHOT/maven-metadata.xml

Downloading: http://repository.apache.org/snapshots/joda-time/joda-time/maven-metadata.xml
Downloading: http://repo.maven.apache.org/maven2/joda-time/joda-time/maven-metadata.xml
931/931 B   
            
Downloaded: http://repo.maven.apache.org/maven2/joda-time/joda-time/maven-metadata.xml (931
B at 6.4 KB/sec)
            
[WARNING] The POM for joda-time:joda-time:jar:2.5 is invalid, transitive dependencies (if
any) will not be available, enable debug logging for more details
Downloading: http://repo.maven.apache.org/maven2/joda-time/joda-time/2.7/joda-time-2.7.pom
4/28 KB     
7/28 KB   
11/28 KB   
14/28 KB   
18/28 KB   
22/28 KB   
26/28 KB   
28/28 KB   
           
Downloaded: http://repo.maven.apache.org/maven2/joda-time/joda-time/2.7/joda-time-2.7.pom
(28 KB at 297.1 KB/sec)
Downloading: http://repo.maven.apache.org/maven2/org/owasp/esapi/esapi/2.1.0/esapi-2.1.0.pom
           
[WARNING] Failed to create parent directories for resolution tracking file /home/jenkins/.m2/repository/org/owasp/esapi/esapi/2.1.0/esapi-2.1.0.pom.lastUpdated
Downloading: http://repository.apache.org/snapshots/org/apache/cloudstack/cloud-framework-config/4.6.0-SNAPSHOT/maven-metadata.xml
           
Downloading: http://repository.apache.org/snapshots/org/apache/cloudstack/cloud-framework-db/4.6.0-SNAPSHOT/maven-metadata.xml
           
Downloading: http://repository.apache.org/snapshots/org/apache/cloudstack/cloud-engine-api/4.6.0-SNAPSHOT/maven-metadata.xml
           
Downloading: http://repository.apache.org/snapshots/org/apache/cloudstack/cloud-framework-rest/4.6.0-SNAPSHOT/maven-metadata.xml
           
Downloading: http://repository.apache.org/snapshots/org/apache/cloudstack/cloud-framework-ipc/4.6.0-SNAPSHOT/maven-metadata.xml
           
Downloading: http://repository.apache.org/snapshots/org/apache/cloudstack/cloud-framework-security/4.6.0-SNAPSHOT/maven-metadata.xml
           
Downloading: http://repository.apache.org/snapshots/org/apache/cloudstack/cloud-framework-cluster/4.6.0-SNAPSHOT/maven-metadata.xml
           
Downloading: http://repository.apache.org/snapshots/org/apache/cloudstack/cloud-framework-jobs/4.6.0-SNAPSHOT/maven-metadata.xml
           
Downloading: http://repository.apache.org/snapshots/org/apache/cloudstack/cloud-framework-events/4.6.0-SNAPSHOT/maven-metadata.xml
           
Downloading: http://repository.apache.org/snapshots/org/apache/cloudstack/cloud-engine-schema/4.6.0-SNAPSHOT/maven-metadata.xml
           
Downloading: http://repository.apache.org/snapshots/org/apache/cloudstack/cloud-engine-components-api/4.6.0-SNAPSHOT/maven-metadata.xml
           
[INFO] ------------------------------------------------------------------------
[INFO] Reactor Summary:
[INFO] 
[INFO] Apache CloudStack apidocs ......................... FAILURE [5.199s]
[INFO] Apache CloudStack marvin .......................... SKIPPED
[INFO] ------------------------------------------------------------------------
[INFO] BUILD FAILURE
[INFO] ------------------------------------------------------------------------
[INFO] Total time: 7.660s
[INFO] Finished at: Fri Jan 23 05:22:59 UTC 2015
[INFO] Final Memory: 36M/309M
[INFO] ------------------------------------------------------------------------
[ERROR] Failed to execute goal on project cloud-apidoc: Could not resolve dependencies for
project org.apache.cloudstack:cloud-apidoc:pom:4.6.0-SNAPSHOT: Failed to collect dependencies
for [org.apache.cloudstack:cloud-server:jar:4.6.0-SNAPSHOT (compile), junit:junit:jar:4.11
(test), org.hamcrest:hamcrest-library:jar:1.3 (test), org.mockito:mockito-all:jar:1.9.5 (test),
org.powermock:powermock-module-junit4:jar:1.5.3 (compile), org.powermock:powermock-api-mockito:jar:1.5.3
(test), org.springframework:spring-test:jar:3.2.12.RELEASE (test), javax.inject:javax.inject:jar:1
(compile)]: Failed to read artifact descriptor for org.owasp.esapi:esapi:jar:2.1.0: Could
not transfer artifact org.owasp.esapi:esapi:pom:2.1.0 from/to central (http://repo.maven.apache.org/maven2):
Specified destination directory cannot be created: /home/jenkins/.m2/repository/org/owasp/esapi/esapi/2.1.0
-> [Help 1]
[ERROR] 
[ERROR] To see the full stack trace of the errors, re-run Maven with the -e switch.
[ERROR] Re-run Maven using the -X switch to enable full debug logging.
[ERROR] 
[ERROR] For more information about the errors and possible solutions, please read the following
articles:
[ERROR] [Help 1] http://cwiki.apache.org/confluence/display/MAVEN/DependencyResolutionException
Build step 'Execute shell' marked build as failure
Archiving artifacts

Mime
View raw message