cloudstack-commits mailing list archives

Site index · List index
Message view « Date » · « Thread »
Top « Date » · « Thread »
From Apache Jenkins Server <jenk...@builds.apache.org>
Subject Build failed in Jenkins: cloudstack-apidocs-master #1479
Date Sun, 04 Aug 2013 04:48:28 GMT
See <https://builds.apache.org/job/cloudstack-apidocs-master/1479/>

------------------------------------------
[...truncated 236 lines...]
Aug 4, 2013 4:06:23 AM org.apache.maven.cli.event.ExecutionEventLogger mojoStarted
INFO: --- maven-resources-plugin:2.5:testResources (default-testResources) @ cloud-utils ---
[debug] execute contextualize
[INFO] Using 'UTF-8' encoding to copy filtered resources.
[INFO] Copying 4 resources
[INFO] Copying 3 resources
Aug 4, 2013 4:06:23 AM org.apache.maven.cli.event.ExecutionEventLogger mojoStarted
INFO: 
Aug 4, 2013 4:06:23 AM org.apache.maven.cli.event.ExecutionEventLogger mojoStarted
INFO: --- maven-compiler-plugin:2.5.1:testCompile (default-testCompile) @ cloud-utils ---
[INFO] Compiling 15 source files to <https://builds.apache.org/job/cloudstack-apidocs-master/ws/utils/target/test-classes>
Aug 4, 2013 4:06:25 AM org.apache.maven.cli.event.ExecutionEventLogger mojoStarted
INFO: 
Aug 4, 2013 4:06:25 AM org.apache.maven.cli.event.ExecutionEventLogger mojoStarted
INFO: --- maven-surefire-plugin:2.12:test (default-test) @ cloud-utils ---
[INFO] Surefire report directory: <https://builds.apache.org/job/cloudstack-apidocs-master/ws/utils/target/surefire-reports>

-------------------------------------------------------
 T E S T S
-------------------------------------------------------
Running com.cloud.utils.crypto.RSAHelperTest
Tests run: 2, Failures: 0, Errors: 0, Skipped: 0, Time elapsed: 0.789 sec
Running com.cloud.utils.StringUtilsTest
Tests run: 23, Failures: 0, Errors: 0, Skipped: 0, Time elapsed: 0.001 sec
Running com.cloud.utils.TernaryTest
Tests run: 1, Failures: 0, Errors: 0, Skipped: 0, Time elapsed: 0.003 sec
Running com.cloud.utils.ScriptTest
2013-08-04 04:06:26,804 DEBUG [utils.script.Script] (main:) Executing: /bin/echo bar 
2013-08-04 04:06:26,809 DEBUG [utils.script.Script] (main:) Execution is successful.
2013-08-04 04:06:26,986 DEBUG [utils.script.Script] (main:) Executing: /bin/bash -c echo 'hello
world!' 
2013-08-04 04:06:27,010 DEBUG [utils.script.Script] (main:) Execution is successful.
2013-08-04 04:06:27,010 DEBUG [utils.script.Script] (main:) Executing: /bin/bash -c echo 'hello
world!' 
2013-08-04 04:06:27,012 DEBUG [utils.script.Script] (main:) Execution is successful.
2013-08-04 04:06:27,013 DEBUG [utils.script.Script] (main:) Looking for pwd in the classpath
2013-08-04 04:06:27,013 DEBUG [utils.script.Script] (main:) System resource: null
2013-08-04 04:06:27,013 DEBUG [utils.script.Script] (main:) Classpath resource: null
Tests run: 8, Failures: 0, Errors: 0, Skipped: 1, Time elapsed: 0.404 sec
Running com.cloud.utils.TestProfiler
Configure log4j with default properties
2013-08-04 04:06:27,020 INFO  [cloud.utils.TestProfiler] (main:) testProfiler() started
2013-08-04 04:06:28,020 INFO  [cloud.utils.TestProfiler] (main:) Duration : 1000
2013-08-04 04:06:28,021 INFO  [cloud.utils.TestProfiler] (main:) testProfiler() stopped
Tests run: 1, Failures: 0, Errors: 0, Skipped: 0, Time elapsed: 1.01 sec
Running com.cloud.utils.ssh.SSHKeysHelperTest
Tests run: 2, Failures: 0, Errors: 0, Skipped: 0, Time elapsed: 0 sec
Running com.cloud.utils.net.NetUtilsTest
2013-08-04 04:06:28,041 INFO  [utils.net.NetUtilsTest] (main:) IP is 1234:5678::1
2013-08-04 04:06:28,043 INFO  [utils.net.NetUtilsTest] (main:) IP is 1234:5678::1
2013-08-04 04:06:28,044 INFO  [utils.net.NetUtilsTest] (main:) IP is 1234:5678::1
2013-08-04 04:06:28,045 INFO  [utils.net.NetUtilsTest] (main:) IP is 1234:5678::1
2013-08-04 04:06:28,047 INFO  [utils.net.NetUtilsTest] (main:) IP is 1234:5678::1
2013-08-04 04:06:28,049 INFO  [utils.net.NetUtilsTest] (main:) IP is 1234:5678::8ed0:17dc:147:1cc9
2013-08-04 04:06:28,050 INFO  [utils.net.NetUtilsTest] (main:) IP is 1234:5678::539a:da40:a82c:5a61
2013-08-04 04:06:28,052 INFO  [utils.net.NetUtilsTest] (main:) IP is 1234:5678::9aee:b8:571a:75b6
2013-08-04 04:06:28,054 INFO  [utils.net.NetUtilsTest] (main:) IP is 1234:5678::86f2:1ea3:6a52:2652
2013-08-04 04:06:28,056 INFO  [utils.net.NetUtilsTest] (main:) IP is 1234:5678::88f3:5ab1:d99c:2fdf
2013-08-04 04:06:28,058 INFO  [utils.net.NetUtilsTest] (main:) IP is 1234:5678::4651:a06e:f31e:13b0
2013-08-04 04:06:28,059 INFO  [utils.net.NetUtilsTest] (main:) IP is 1234:5678::3c6a:7081:932b:c401
2013-08-04 04:06:28,061 INFO  [utils.net.NetUtilsTest] (main:) IP is 1234:5678::e609:7e9e:f4b6:8a52
2013-08-04 04:06:28,063 INFO  [utils.net.NetUtilsTest] (main:) IP is 1234:5678::7228:470b:9131:708c
2013-08-04 04:06:28,065 INFO  [utils.net.NetUtilsTest] (main:) IP is 1234:5678::509f:d6f:b6ff:6d48
2013-08-04 04:06:28,071 INFO  [utils.net.NetUtils] (main:) Invalid value of cidr 10.3.6.5/50
Tests run: 7, Failures: 0, Errors: 0, Skipped: 0, Time elapsed: 0.039 sec
Running com.cloud.utils.xmlobject.TestXmlObject
Tests run: 1, Failures: 0, Errors: 0, Skipped: 0, Time elapsed: 0 sec
Running com.cloud.utils.xmlobject.TestXmlObject2
<test key2="value2" key1="value1" />
<test key2="value2" key1="value1"><child1><child2 ckey1="value1" /></child1></test>
<test2 key1="value1"><child1>yyy</child1><child1><child2><child3
key3="value3">xxxxx</child3></child2></child1></test2>
Tests run: 1, Failures: 0, Errors: 0, Skipped: 0, Time elapsed: 0.001 sec
Running com.cloud.utils.ReflectUtilTest
Tests run: 3, Failures: 0, Errors: 0, Skipped: 0, Time elapsed: 0.012 sec

Results :

Tests run: 49, Failures: 0, Errors: 0, Skipped: 1

[JENKINS] Recording test results
Aug 4, 2013 4:06:32 AM org.apache.maven.cli.event.ExecutionEventLogger mojoStarted
INFO: 
Aug 4, 2013 4:06:32 AM org.apache.maven.cli.event.ExecutionEventLogger mojoStarted
INFO: --- maven-jar-plugin:2.4:jar (default-jar) @ cloud-utils ---
[INFO] Building jar: <https://builds.apache.org/job/cloudstack-apidocs-master/ws/utils/target/cloud-utils-4.3.0-SNAPSHOT.jar>
Aug 4, 2013 4:06:33 AM org.apache.maven.cli.event.ExecutionEventLogger mojoStarted
INFO: 
Aug 4, 2013 4:06:33 AM org.apache.maven.cli.event.ExecutionEventLogger mojoStarted
INFO: --- maven-site-plugin:3.1:attach-descriptor (attach-descriptor) @ cloud-utils ---
Aug 4, 2013 4:06:33 AM org.apache.maven.cli.event.ExecutionEventLogger mojoStarted
INFO: 
Aug 4, 2013 4:06:33 AM org.apache.maven.cli.event.ExecutionEventLogger mojoStarted
INFO: --- maven-jar-plugin:2.4:test-jar (default) @ cloud-utils ---
[INFO] Building jar: <https://builds.apache.org/job/cloudstack-apidocs-master/ws/utils/target/cloud-utils-4.3.0-SNAPSHOT-tests.jar>
Aug 4, 2013 4:06:33 AM org.apache.maven.cli.event.ExecutionEventLogger mojoStarted
INFO: 
Aug 4, 2013 4:06:33 AM org.apache.maven.cli.event.ExecutionEventLogger mojoStarted
INFO: --- maven-install-plugin:2.3.1:install (default-install) @ cloud-utils ---
[INFO] Installing <https://builds.apache.org/job/cloudstack-apidocs-master/ws/utils/target/cloud-utils-4.3.0-SNAPSHOT.jar>
to /home/jenkins/jenkins-slave/maven-repositories/1/org/apache/cloudstack/cloud-utils/4.3.0-SNAPSHOT/cloud-utils-4.3.0-SNAPSHOT.jar
[INFO] Installing <https://builds.apache.org/job/cloudstack-apidocs-master/ws/utils/pom.xml>
to /home/jenkins/jenkins-slave/maven-repositories/1/org/apache/cloudstack/cloud-utils/4.3.0-SNAPSHOT/cloud-utils-4.3.0-SNAPSHOT.pom
[INFO] Installing <https://builds.apache.org/job/cloudstack-apidocs-master/ws/utils/target/cloud-utils-4.3.0-SNAPSHOT-tests.jar>
to /home/jenkins/jenkins-slave/maven-repositories/1/org/apache/cloudstack/cloud-utils/4.3.0-SNAPSHOT/cloud-utils-4.3.0-SNAPSHOT-tests.jar
Aug 4, 2013 4:06:34 AM org.apache.maven.cli.event.ExecutionEventLogger projectStarted
INFO:                                                                         
Aug 4, 2013 4:06:34 AM org.apache.maven.cli.event.ExecutionEventLogger projectStarted
INFO: ------------------------------------------------------------------------
Aug 4, 2013 4:06:34 AM org.apache.maven.cli.event.ExecutionEventLogger projectStarted
INFO: Building Apache CloudStack Framework 4.3.0-SNAPSHOT
Aug 4, 2013 4:06:34 AM org.apache.maven.cli.event.ExecutionEventLogger projectStarted
INFO: ------------------------------------------------------------------------
Aug 4, 2013 4:06:34 AM org.apache.maven.cli.event.ExecutionEventLogger mojoStarted
INFO: 
Aug 4, 2013 4:06:34 AM org.apache.maven.cli.event.ExecutionEventLogger mojoStarted
INFO: --- maven-clean-plugin:2.5:clean (default-clean) @ cloudstack-framework ---
[INFO] Deleting <https://builds.apache.org/job/cloudstack-apidocs-master/ws/framework/target>
(includes = [**/*], excludes = [])
Aug 4, 2013 4:06:34 AM org.apache.maven.cli.event.ExecutionEventLogger mojoStarted
INFO: 
Aug 4, 2013 4:06:34 AM org.apache.maven.cli.event.ExecutionEventLogger mojoStarted
INFO: --- maven-remote-resources-plugin:1.3:process (default) @ cloudstack-framework ---
Aug 4, 2013 4:06:34 AM org.apache.maven.cli.event.ExecutionEventLogger mojoStarted
INFO: 
Aug 4, 2013 4:06:34 AM org.apache.maven.cli.event.ExecutionEventLogger mojoStarted
INFO: --- maven-site-plugin:3.1:attach-descriptor (attach-descriptor) @ cloudstack-framework
---
Aug 4, 2013 4:06:34 AM org.apache.maven.cli.event.ExecutionEventLogger mojoStarted
INFO: 
Aug 4, 2013 4:06:34 AM org.apache.maven.cli.event.ExecutionEventLogger mojoStarted
INFO: --- maven-install-plugin:2.3.1:install (default-install) @ cloudstack-framework ---
[INFO] Installing <https://builds.apache.org/job/cloudstack-apidocs-master/ws/framework/pom.xml>
to /home/jenkins/jenkins-slave/maven-repositories/1/org/apache/cloudstack/cloudstack-framework/4.3.0-SNAPSHOT/cloudstack-framework-4.3.0-SNAPSHOT.pom
Aug 4, 2013 4:06:34 AM org.apache.maven.cli.event.ExecutionEventLogger projectStarted
INFO:                                                                         
Aug 4, 2013 4:06:34 AM org.apache.maven.cli.event.ExecutionEventLogger projectStarted
INFO: ------------------------------------------------------------------------
Aug 4, 2013 4:06:34 AM org.apache.maven.cli.event.ExecutionEventLogger projectStarted
INFO: Building Apache CloudStack Framework - Event Notification 4.3.0-SNAPSHOT
Aug 4, 2013 4:06:34 AM org.apache.maven.cli.event.ExecutionEventLogger projectStarted
INFO: ------------------------------------------------------------------------
Aug 4, 2013 4:06:34 AM org.apache.maven.cli.event.ExecutionEventLogger mojoStarted
INFO: 
Aug 4, 2013 4:06:34 AM org.apache.maven.cli.event.ExecutionEventLogger mojoStarted
INFO: --- maven-clean-plugin:2.5:clean (default-clean) @ cloud-framework-db ---
[INFO] Deleting <https://builds.apache.org/job/cloudstack-apidocs-master/ws/framework/db/target>
(includes = [**/*], excludes = [])
Aug 4, 2013 4:06:35 AM org.apache.maven.cli.event.ExecutionEventLogger mojoStarted
INFO: 
Aug 4, 2013 4:06:35 AM org.apache.maven.cli.event.ExecutionEventLogger mojoStarted
INFO: --- maven-remote-resources-plugin:1.3:process (default) @ cloud-framework-db ---
Aug 4, 2013 4:06:35 AM org.apache.maven.cli.event.ExecutionEventLogger mojoStarted
INFO: 
Aug 4, 2013 4:06:35 AM org.apache.maven.cli.event.ExecutionEventLogger mojoStarted
INFO: --- maven-resources-plugin:2.5:resources (default-resources) @ cloud-framework-db ---
[debug] execute contextualize
[INFO] Using 'UTF-8' encoding to copy filtered resources.
[INFO] skip non existing resourceDirectory <https://builds.apache.org/job/cloudstack-apidocs-master/ws/framework/db/src/main/resources>
[INFO] Copying 3 resources
Aug 4, 2013 4:06:35 AM org.apache.maven.cli.event.ExecutionEventLogger mojoStarted
INFO: 
Aug 4, 2013 4:06:35 AM org.apache.maven.cli.event.ExecutionEventLogger mojoStarted
INFO: --- maven-compiler-plugin:2.5.1:compile (default-compile) @ cloud-framework-db ---
[INFO] Compiling 34 source files to <https://builds.apache.org/job/cloudstack-apidocs-master/ws/framework/db/target/classes>
Aug 4, 2013 4:06:44 AM org.apache.maven.cli.event.ExecutionEventLogger mojoStarted
INFO: 
Aug 4, 2013 4:06:44 AM org.apache.maven.cli.event.ExecutionEventLogger mojoStarted
INFO: --- maven-resources-plugin:2.5:testResources (default-testResources) @ cloud-framework-db
---
[debug] execute contextualize
[INFO] Using 'UTF-8' encoding to copy filtered resources.
[INFO] skip non existing resourceDirectory <https://builds.apache.org/job/cloudstack-apidocs-master/ws/framework/db/test/resources>
[INFO] Copying 3 resources
Aug 4, 2013 4:06:44 AM org.apache.maven.cli.event.ExecutionEventLogger mojoStarted
INFO: 
Aug 4, 2013 4:06:44 AM org.apache.maven.cli.event.ExecutionEventLogger mojoStarted
INFO: --- maven-compiler-plugin:2.5.1:testCompile (default-testCompile) @ cloud-framework-db
---
[INFO] Compiling 11 source files to <https://builds.apache.org/job/cloudstack-apidocs-master/ws/framework/db/target/test-classes>
[cloudstack-apidocs-master] $ /bin/bash -xe /tmp/hudson721902452219177098.sh
+ mvn -P developer -pl :cloud-apidoc
[INFO] Scanning for projects...
[INFO]                                                                         
[INFO] ------------------------------------------------------------------------
[INFO] Building Apache CloudStack apidocs 4.3.0-SNAPSHOT
[INFO] ------------------------------------------------------------------------
[INFO] 
[INFO] --- maven-remote-resources-plugin:1.3:process (default) @ cloud-apidoc ---
[INFO] 
[INFO] --- exec-maven-plugin:1.2.1:exec (compile) @ cloud-apidoc ---
Check, is this api part of another build profile? Null value for key: addVmwareDc preProcessedCommand=1
Check, is this api part of another build profile? Null value for key: removeVmwareDc preProcessedCommand=1
Check, is this api part of another build profile? Null value for key: listVmwareDcs preProcessedCommand=1
Check, is this api part of another build profile? Null value for key: deleteCiscoNexusVSM
preProcessedCommand=1
Check, is this api part of another build profile? Null value for key: enableCiscoNexusVSM
preProcessedCommand=1
Check, is this api part of another build profile? Null value for key: disableCiscoNexusVSM
preProcessedCommand=1
Check, is this api part of another build profile? Null value for key: listCiscoNexusVSMs preProcessedCommand=1
Check, is this api part of another build profile? Null value for key: addExternalLoadBalancer
preProcessedCommand=1
Check, is this api part of another build profile? Null value for key: deleteExternalLoadBalancer
preProcessedCommand=1
Check, is this api part of another build profile? Null value for key: listExternalLoadBalancers
preProcessedCommand=1
Check, is this api part of another build profile? Null value for key: addF5LoadBalancer preProcessedCommand=1
Check, is this api part of another build profile? Null value for key: configureF5LoadBalancer
preProcessedCommand=1
Check, is this api part of another build profile? Null value for key: deleteF5LoadBalancer
preProcessedCommand=1
Check, is this api part of another build profile? Null value for key: listF5LoadBalancers
preProcessedCommand=1
Check, is this api part of another build profile? Null value for key: listF5LoadBalancerNetworks
preProcessedCommand=1
Check, is this api part of another build profile? Null value for key: addExternalFirewall
preProcessedCommand=1
Check, is this api part of another build profile? Null value for key: deleteExternalFirewall
preProcessedCommand=1
Check, is this api part of another build profile? Null value for key: listExternalFirewalls
preProcessedCommand=1
Check, is this api part of another build profile? Null value for key: addSrxFirewall preProcessedCommand=1
Check, is this api part of another build profile? Null value for key: deleteSrxFirewall preProcessedCommand=1
Check, is this api part of another build profile? Null value for key: configureSrxFirewall
preProcessedCommand=1
Check, is this api part of another build profile? Null value for key: listSrxFirewalls preProcessedCommand=1
Check, is this api part of another build profile? Null value for key: listSrxFirewallNetworks
preProcessedCommand=1
Check, is this api part of another build profile? Null value for key: createVolumeOnFiler
preProcessedCommand=15
Check, is this api part of another build profile? Null value for key: destroyVolumeOnFiler
preProcessedCommand=15
Check, is this api part of another build profile? Null value for key: listVolumesOnFiler preProcessedCommand=15
Check, is this api part of another build profile? Null value for key: createLunOnFiler preProcessedCommand=15
Check, is this api part of another build profile? Null value for key: destroyLunOnFiler preProcessedCommand=15
Check, is this api part of another build profile? Null value for key: listLunsOnFiler preProcessedCommand=15
Check, is this api part of another build profile? Null value for key: associateLun preProcessedCommand=15
Check, is this api part of another build profile? Null value for key: dissociateLun preProcessedCommand=15
Check, is this api part of another build profile? Null value for key: createPool preProcessedCommand=15
Check, is this api part of another build profile? Null value for key: deletePool preProcessedCommand=15
Check, is this api part of another build profile? Null value for key: modifyPool preProcessedCommand=15
Check, is this api part of another build profile? Null value for key: listPools preProcessedCommand=15
Check, is this api part of another build profile? Null value for key: addNetscalerLoadBalancer
preProcessedCommand=1
Check, is this api part of another build profile? Null value for key: deleteNetscalerLoadBalancer
preProcessedCommand=1
Check, is this api part of another build profile? Null value for key: configureNetscalerLoadBalancer
preProcessedCommand=1
Check, is this api part of another build profile? Null value for key: listNetscalerLoadBalancers
preProcessedCommand=1
Check, is this api part of another build profile? Null value for key: listNetscalerLoadBalancerNetworks
preProcessedCommand=1
Check, is this api part of another build profile? Null value for key: configureSimulator preProcessedCommand=1
Check, is this api part of another build profile? Null value for key: addCiscoVnmcResource
preProcessedCommand=1
Check, is this api part of another build profile? Null value for key: deleteCiscoVnmcResource
preProcessedCommand=1
Check, is this api part of another build profile? Null value for key: listCiscoVnmcResources
preProcessedCommand=1
Check, is this api part of another build profile? Null value for key: addCiscoAsa1000vResource
preProcessedCommand=1
Check, is this api part of another build profile? Null value for key: deleteCiscoAsa1000vResource
preProcessedCommand=1
Check, is this api part of another build profile? Null value for key: listCiscoAsa1000vResources
preProcessedCommand=1
Traceback (most recent call last):
  File "<https://builds.apache.org/job/cloudstack-apidocs-master/ws/tools/apidoc/gen_toc.py",>
line 190, in <module>
    category = choose_category(fn)
  File "<https://builds.apache.org/job/cloudstack-apidocs-master/ws/tools/apidoc/gen_toc.py",>
line 170, in choose_category
    (fn, __file__))
Exception: Need to add a category for createCacheStore.xml to <https://builds.apache.org/job/cloudstack-apidocs-master/ws/tools/apidoc/gen_toc.py>:known_categories
[INFO] ------------------------------------------------------------------------
[INFO] BUILD FAILURE
[INFO] ------------------------------------------------------------------------
[INFO] Total time: 16.106s
[INFO] Finished at: Sun Aug 04 04:48:27 UTC 2013
[INFO] Final Memory: 19M/117M
[INFO] ------------------------------------------------------------------------
[ERROR] Failed to execute goal org.codehaus.mojo:exec-maven-plugin:1.2.1:exec (compile) on
project cloud-apidoc: Command execution failed. Process exited with an error: 1 (Exit value:
1) -> [Help 1]
[ERROR] 
[ERROR] To see the full stack trace of the errors, re-run Maven with the -e switch.
[ERROR] Re-run Maven using the -X switch to enable full debug logging.
[ERROR] 
[ERROR] For more information about the errors and possible solutions, please read the following
articles:
[ERROR] [Help 1] http://cwiki.apache.org/confluence/display/MAVEN/MojoExecutionException
Build step 'Execute shell' marked build as failure
ERROR: Maven JVM terminated unexpectedly with exit code 143
Archiving artifacts

Mime
View raw message