cloudstack-commits mailing list archives

Site index · List index
Message view « Date » · « Thread »
Top « Date » · « Thread »
From Apache Jenkins Server <jenk...@builds.apache.org>
Subject Build failed in Jenkins: cloudstack-apidocs-master #1468
Date Fri, 02 Aug 2013 17:05:22 GMT
See <https://builds.apache.org/job/cloudstack-apidocs-master/1468/changes>

Changes:

[alena.prokharchyk] CLOUDSTACK-4022: listProjects - do searchIncludingRemoved when getting
info of corresponding projectAccount because when the project is being removed, its account
is marked as Removed first, but we might still want to retrieve its info

------------------------------------------
[...truncated 1426 lines...]
 T E S T S
-------------------------------------------------------

Results :

Tests run: 0, Failures: 0, Errors: 0, Skipped: 0

[JENKINS] Recording test results
Aug 2, 2013 4:31:30 PM org.apache.maven.cli.event.ExecutionEventLogger mojoStarted
INFO: 
Aug 2, 2013 4:31:30 PM org.apache.maven.cli.event.ExecutionEventLogger mojoStarted
INFO: --- maven-jar-plugin:2.4:jar (default-jar) @ cloud-framework-events ---
[INFO] Building jar: <https://builds.apache.org/job/cloudstack-apidocs-master/ws/framework/events/target/cloud-framework-events-4.3.0-SNAPSHOT.jar>
Aug 2, 2013 4:31:30 PM org.apache.maven.cli.event.ExecutionEventLogger mojoStarted
INFO: 
Aug 2, 2013 4:31:30 PM org.apache.maven.cli.event.ExecutionEventLogger mojoStarted
INFO: --- maven-site-plugin:3.1:attach-descriptor (attach-descriptor) @ cloud-framework-events
---
Aug 2, 2013 4:31:30 PM org.apache.maven.cli.event.ExecutionEventLogger mojoStarted
INFO: 
Aug 2, 2013 4:31:30 PM org.apache.maven.cli.event.ExecutionEventLogger mojoStarted
INFO: --- maven-install-plugin:2.3.1:install (default-install) @ cloud-framework-events ---
[INFO] Installing <https://builds.apache.org/job/cloudstack-apidocs-master/ws/framework/events/target/cloud-framework-events-4.3.0-SNAPSHOT.jar>
to /home/jenkins/jenkins-slave/maven-repositories/0/org/apache/cloudstack/cloud-framework-events/4.3.0-SNAPSHOT/cloud-framework-events-4.3.0-SNAPSHOT.jar
[INFO] Installing <https://builds.apache.org/job/cloudstack-apidocs-master/ws/framework/events/pom.xml>
to /home/jenkins/jenkins-slave/maven-repositories/0/org/apache/cloudstack/cloud-framework-events/4.3.0-SNAPSHOT/cloud-framework-events-4.3.0-SNAPSHOT.pom
Aug 2, 2013 4:31:30 PM org.apache.maven.cli.event.ExecutionEventLogger projectStarted
INFO:                                                                         
Aug 2, 2013 4:31:30 PM org.apache.maven.cli.event.ExecutionEventLogger projectStarted
INFO: ------------------------------------------------------------------------
Aug 2, 2013 4:31:30 PM org.apache.maven.cli.event.ExecutionEventLogger projectStarted
INFO: Building Apache CloudStack Server 4.3.0-SNAPSHOT
Aug 2, 2013 4:31:30 PM org.apache.maven.cli.event.ExecutionEventLogger projectStarted
INFO: ------------------------------------------------------------------------
Aug 2, 2013 4:31:31 PM org.apache.maven.cli.event.ExecutionEventLogger mojoStarted
INFO: 
Aug 2, 2013 4:31:31 PM org.apache.maven.cli.event.ExecutionEventLogger mojoStarted
INFO: --- maven-clean-plugin:2.5:clean (default-clean) @ cloud-server ---
[INFO] Deleting <https://builds.apache.org/job/cloudstack-apidocs-master/ws/server/target>
(includes = [**/*], excludes = [])
Aug 2, 2013 4:31:32 PM org.apache.maven.cli.event.ExecutionEventLogger mojoStarted
INFO: 
Aug 2, 2013 4:31:32 PM org.apache.maven.cli.event.ExecutionEventLogger mojoStarted
INFO: --- maven-remote-resources-plugin:1.3:process (default) @ cloud-server ---
Aug 2, 2013 4:31:32 PM org.apache.maven.cli.event.ExecutionEventLogger mojoStarted
INFO: 
Aug 2, 2013 4:31:32 PM org.apache.maven.cli.event.ExecutionEventLogger mojoStarted
INFO: --- maven-antrun-plugin:1.7:run (generate-resource) @ cloud-server ---
[INFO] Executing tasks

main:
     [copy] Copying 3 files to <https://builds.apache.org/job/cloudstack-apidocs-master/ws/server/target/conf>
     [copy] Copying 1 file to <https://builds.apache.org/job/cloudstack-apidocs-master/ws/server/target/conf>
[INFO] Executed tasks
Aug 2, 2013 4:31:33 PM org.apache.maven.cli.event.ExecutionEventLogger mojoStarted
INFO: 
Aug 2, 2013 4:31:33 PM org.apache.maven.cli.event.ExecutionEventLogger mojoStarted
INFO: --- maven-resources-plugin:2.5:resources (default-resources) @ cloud-server ---
[debug] execute contextualize
[INFO] Using 'UTF-8' encoding to copy filtered resources.
[INFO] Copying 1 resource
[INFO] Copying 3 resources
Aug 2, 2013 4:31:33 PM org.apache.maven.cli.event.ExecutionEventLogger mojoStarted
INFO: 
Aug 2, 2013 4:31:33 PM org.apache.maven.cli.event.ExecutionEventLogger mojoStarted
INFO: --- maven-compiler-plugin:2.5.1:compile (default-compile) @ cloud-server ---
[INFO] Compiling 434 source files to <https://builds.apache.org/job/cloudstack-apidocs-master/ws/server/target/classes>
Aug 2, 2013 4:31:40 PM org.apache.maven.cli.event.ExecutionEventLogger mojoStarted
INFO: 
Aug 2, 2013 4:31:40 PM org.apache.maven.cli.event.ExecutionEventLogger mojoStarted
INFO: --- maven-resources-plugin:2.5:testResources (default-testResources) @ cloud-server
---
[debug] execute contextualize
[INFO] Using 'UTF-8' encoding to copy filtered resources.
[INFO] Copying 14 resources
[INFO] Copying 3 resources
Aug 2, 2013 4:31:40 PM org.apache.maven.cli.event.ExecutionEventLogger mojoStarted
INFO: 
Aug 2, 2013 4:31:40 PM org.apache.maven.cli.event.ExecutionEventLogger mojoStarted
INFO: --- maven-compiler-plugin:2.5.1:testCompile (default-testCompile) @ cloud-server ---
[INFO] Compiling 76 source files to <https://builds.apache.org/job/cloudstack-apidocs-master/ws/server/target/test-classes>
Aug 2, 2013 4:31:42 PM org.apache.maven.cli.event.ExecutionEventLogger mojoStarted
INFO: 
Aug 2, 2013 4:31:42 PM org.apache.maven.cli.event.ExecutionEventLogger mojoStarted
INFO: --- maven-surefire-plugin:2.12:test (default-test) @ cloud-server ---
[INFO] Surefire report directory: <https://builds.apache.org/job/cloudstack-apidocs-master/ws/server/target/surefire-reports>

-------------------------------------------------------
 T E S T S
-------------------------------------------------------
Running org.apache.cloudstack.affinity.AffinityApiUnitTest
log4j:WARN No appenders could be found for logger (org.springframework.test.context.junit4.SpringJUnit4ClassRunner).
log4j:WARN Please initialize the log4j system properly.
log4j:WARN See http://logging.apache.org/log4j/1.2/faq.html#noconfig for more info.
Tests run: 7, Failures: 0, Errors: 0, Skipped: 0, Time elapsed: 1.445 sec
Running org.apache.cloudstack.networkoffering.CreateNetworkOfferingTest
Tests run: 10, Failures: 0, Errors: 0, Skipped: 0, Time elapsed: 6.324 sec
Running org.apache.cloudstack.region.RegionManagerTest
Tests run: 1, Failures: 0, Errors: 0, Skipped: 0, Time elapsed: 0.014 sec
Running org.apache.cloudstack.region.gslb.GlobalLoadBalancingRulesServiceImplTest
Tests run: 4, Failures: 0, Errors: 0, Skipped: 0, Time elapsed: 0.072 sec
Running org.apache.cloudstack.privategw.AclOnPrivateGwTest
Tests run: 2, Failures: 0, Errors: 0, Skipped: 0, Time elapsed: 0.428 sec
Running org.apache.cloudstack.lb.ApplicationLoadBalancerTest
Tests run: 11, Failures: 0, Errors: 0, Skipped: 0, Time elapsed: 0.233 sec
Running com.cloud.network.NetworkManagerTest
Tests run: 1, Failures: 0, Errors: 0, Skipped: 1, Time elapsed: 0 sec
Running com.cloud.network.security.SecurityGroupManagerImplTest
Tests run: 4, Failures: 0, Errors: 0, Skipped: 0, Time elapsed: 0.999 sec
Running com.cloud.network.security.SecurityGroupQueueTest
Num Vms= 50 Queue size = 50
Num Vms= 20000 Queue size = 20000 time=630 ms
Num Vms= 5000 Queue size = 5000 time=1216 ms
Num Vms= 1 Queue size = 1 time=1 ms
Num Vms= 1000000 Queue size = 1000000 time=1150 ms
Num Vms= 1 Queue size = 1 time=439 ms
Total jobs dequeued = 10, num queued=1005 queue current size=995
Total jobs dequeued = 10, num queued=1005 queue current size=995
Total jobs dequeued = 1, num queued=1001 queue current size=1000
Total jobs dequeued = 10, num queued=1000 queue current size=990
Total jobs dequeued = 10, num queued=10 queue current size=0
Tests run: 4, Failures: 0, Errors: 0, Skipped: 0, Time elapsed: 3.498 sec
Running com.cloud.network.firewall.FirewallManagerTest
Tests run: 1, Failures: 0, Errors: 0, Skipped: 1, Time elapsed: 0 sec
Running com.cloud.network.DedicateGuestVlanRangesTest
Tests run: 2, Failures: 0, Errors: 0, Skipped: 0, Time elapsed: 0.062 sec
Running com.cloud.network.UpdatePhysicalNetworkTest
Tests run: 1, Failures: 0, Errors: 0, Skipped: 0, Time elapsed: 0.023 sec
Running com.cloud.network.dao.NetworkDaoTest
Tests run: 2, Failures: 0, Errors: 0, Skipped: 0, Time elapsed: 0.001 sec
Running com.cloud.network.NetworkModelTest
Tests run: 1, Failures: 0, Errors: 0, Skipped: 0, Time elapsed: 0.031 sec
Running com.cloud.vm.UserVmManagerTest
Tests run: 9, Failures: 0, Errors: 0, Skipped: 0, Time elapsed: 0.209 sec
Running com.cloud.vm.VirtualMachineManagerImplTest
Tests run: 7, Failures: 0, Errors: 0, Skipped: 0, Time elapsed: 0.255 sec
Running com.cloud.vm.snapshot.VMSnapshotManagerTest
Tests run: 7, Failures: 0, Errors: 0, Skipped: 0, Time elapsed: 0.086 sec
Running com.cloud.vm.DeploymentPlanningManagerImplTest
Tests run: 3, Failures: 0, Errors: 0, Skipped: 0, Time elapsed: 0.402 sec
Running com.cloud.alert.AlertControlsUnitTest
Tests run: 1, Failures: 0, Errors: 0, Skipped: 0, Time elapsed: 0.032 sec
Running com.cloud.configuration.ValidateIpRangeTest
Tests run: 3, Failures: 0, Errors: 0, Skipped: 0, Time elapsed: 0.003 sec
Running com.cloud.configuration.ConfigurationManagerTest
Tests run: 2, Failures: 0, Errors: 0, Skipped: 0, Time elapsed: 0.016 sec
Running com.cloud.metadata.ResourceMetaDataManagerTest
Tests run: 1, Failures: 0, Errors: 0, Skipped: 0, Time elapsed: 0.028 sec
Running com.cloud.event.EventControlsUnitTest
Tests run: 1, Failures: 0, Errors: 0, Skipped: 0, Time elapsed: 0 sec
Running com.cloud.keystore.KeystoreTest
org.apache.cloudstack.api.response.UserVmResponse/null/{"id":"3","securitygroup":[],"nic":[],"tags":[],"affinitygroup":[]}
org.apache.cloudstack.api.response.AlertResponse/null/{"id":"100","description":"Hello"}
Tests run: 1, Failures: 0, Errors: 0, Skipped: 0, Time elapsed: 0.072 sec
Running com.cloud.resourcelimit.ResourceLimitManagerImplTest
Tests run: 1, Failures: 0, Errors: 0, Skipped: 0, Time elapsed: 0 sec
Running com.cloud.vpc.Site2SiteVpnTest
Tests run: 1, Failures: 0, Errors: 0, Skipped: 0, Time elapsed: 1.904 sec
Running com.cloud.vpc.NetworkACLManagerTest
Tests run: 5, Failures: 0, Errors: 0, Skipped: 0, Time elapsed: 0.124 sec
Running com.cloud.vpc.VpcTest
Tests run: 1, Failures: 0, Errors: 0, Skipped: 0, Time elapsed: 0.107 sec
Running com.cloud.vpc.NetworkACLServiceTest
Tests run: 5, Failures: 0, Errors: 0, Skipped: 0, Time elapsed: 0.072 sec
Running com.cloud.capacity.CapacityManagerTest
Tests run: 1, Failures: 0, Errors: 0, Skipped: 0, Time elapsed: 0.029 sec
Running com.cloud.server.ConfigurationServerImplTest
Tests run: 3, Failures: 0, Errors: 0, Skipped: 0, Time elapsed: 0.019 sec

Results :

Tests run: 103, Failures: 0, Errors: 0, Skipped: 2

[cloudstack-apidocs-master] $ /bin/bash -xe /tmp/hudson2826957772575825374.sh
+ mvn -P developer -pl :cloud-apidoc
[INFO] Scanning for projects...
[INFO]                                                                         
[INFO] ------------------------------------------------------------------------
[INFO] Building Apache CloudStack apidocs 4.3.0-SNAPSHOT
[INFO] ------------------------------------------------------------------------
[INFO] 
[INFO] --- maven-remote-resources-plugin:1.3:process (default) @ cloud-apidoc ---
[INFO] 
[INFO] --- exec-maven-plugin:1.2.1:exec (compile) @ cloud-apidoc ---
Check, is this api part of another build profile? Null value for key: addVmwareDc preProcessedCommand=1
Check, is this api part of another build profile? Null value for key: removeVmwareDc preProcessedCommand=1
Check, is this api part of another build profile? Null value for key: listVmwareDcs preProcessedCommand=1
Check, is this api part of another build profile? Null value for key: deleteCiscoNexusVSM
preProcessedCommand=1
Check, is this api part of another build profile? Null value for key: enableCiscoNexusVSM
preProcessedCommand=1
Check, is this api part of another build profile? Null value for key: disableCiscoNexusVSM
preProcessedCommand=1
Check, is this api part of another build profile? Null value for key: listCiscoNexusVSMs preProcessedCommand=1
Check, is this api part of another build profile? Null value for key: addExternalLoadBalancer
preProcessedCommand=1
Check, is this api part of another build profile? Null value for key: deleteExternalLoadBalancer
preProcessedCommand=1
Check, is this api part of another build profile? Null value for key: listExternalLoadBalancers
preProcessedCommand=1
Check, is this api part of another build profile? Null value for key: addF5LoadBalancer preProcessedCommand=1
Check, is this api part of another build profile? Null value for key: configureF5LoadBalancer
preProcessedCommand=1
Check, is this api part of another build profile? Null value for key: deleteF5LoadBalancer
preProcessedCommand=1
Check, is this api part of another build profile? Null value for key: listF5LoadBalancers
preProcessedCommand=1
Check, is this api part of another build profile? Null value for key: listF5LoadBalancerNetworks
preProcessedCommand=1
Check, is this api part of another build profile? Null value for key: addExternalFirewall
preProcessedCommand=1
Check, is this api part of another build profile? Null value for key: deleteExternalFirewall
preProcessedCommand=1
Check, is this api part of another build profile? Null value for key: listExternalFirewalls
preProcessedCommand=1
Check, is this api part of another build profile? Null value for key: addSrxFirewall preProcessedCommand=1
Check, is this api part of another build profile? Null value for key: deleteSrxFirewall preProcessedCommand=1
Check, is this api part of another build profile? Null value for key: configureSrxFirewall
preProcessedCommand=1
Check, is this api part of another build profile? Null value for key: listSrxFirewalls preProcessedCommand=1
Check, is this api part of another build profile? Null value for key: listSrxFirewallNetworks
preProcessedCommand=1
Check, is this api part of another build profile? Null value for key: createVolumeOnFiler
preProcessedCommand=15
Check, is this api part of another build profile? Null value for key: destroyVolumeOnFiler
preProcessedCommand=15
Check, is this api part of another build profile? Null value for key: listVolumesOnFiler preProcessedCommand=15
Check, is this api part of another build profile? Null value for key: createLunOnFiler preProcessedCommand=15
Check, is this api part of another build profile? Null value for key: destroyLunOnFiler preProcessedCommand=15
Check, is this api part of another build profile? Null value for key: listLunsOnFiler preProcessedCommand=15
Check, is this api part of another build profile? Null value for key: associateLun preProcessedCommand=15
Check, is this api part of another build profile? Null value for key: dissociateLun preProcessedCommand=15
Check, is this api part of another build profile? Null value for key: createPool preProcessedCommand=15
Check, is this api part of another build profile? Null value for key: deletePool preProcessedCommand=15
Check, is this api part of another build profile? Null value for key: modifyPool preProcessedCommand=15
Check, is this api part of another build profile? Null value for key: listPools preProcessedCommand=15
Check, is this api part of another build profile? Null value for key: addNetscalerLoadBalancer
preProcessedCommand=1
Check, is this api part of another build profile? Null value for key: deleteNetscalerLoadBalancer
preProcessedCommand=1
Check, is this api part of another build profile? Null value for key: configureNetscalerLoadBalancer
preProcessedCommand=1
Check, is this api part of another build profile? Null value for key: listNetscalerLoadBalancers
preProcessedCommand=1
Check, is this api part of another build profile? Null value for key: listNetscalerLoadBalancerNetworks
preProcessedCommand=1
Check, is this api part of another build profile? Null value for key: configureSimulator preProcessedCommand=1
Check, is this api part of another build profile? Null value for key: addCiscoVnmcResource
preProcessedCommand=1
Check, is this api part of another build profile? Null value for key: deleteCiscoVnmcResource
preProcessedCommand=1
Check, is this api part of another build profile? Null value for key: listCiscoVnmcResources
preProcessedCommand=1
Check, is this api part of another build profile? Null value for key: addCiscoAsa1000vResource
preProcessedCommand=1
Check, is this api part of another build profile? Null value for key: deleteCiscoAsa1000vResource
preProcessedCommand=1
Check, is this api part of another build profile? Null value for key: listCiscoAsa1000vResources
preProcessedCommand=1
Traceback (most recent call last):
  File "<https://builds.apache.org/job/cloudstack-apidocs-master/ws/tools/apidoc/gen_toc.py",>
line 190, in <module>
    category = choose_category(fn)
  File "<https://builds.apache.org/job/cloudstack-apidocs-master/ws/tools/apidoc/gen_toc.py",>
line 170, in choose_category
    (fn, __file__))
Exception: Need to add a category for createCacheStore.xml to <https://builds.apache.org/job/cloudstack-apidocs-master/ws/tools/apidoc/gen_toc.py>:known_categories
[INFO] ------------------------------------------------------------------------
[INFO] BUILD FAILURE
[INFO] ------------------------------------------------------------------------
[INFO] Total time: 18.161s
[INFO] Finished at: Fri Aug 02 17:05:21 UTC 2013
[INFO] Final Memory: 18M/117M
[INFO] ------------------------------------------------------------------------
[ERROR] Failed to execute goal org.codehaus.mojo:exec-maven-plugin:1.2.1:exec (compile) on
project cloud-apidoc: Command execution failed. Process exited with an error: 1 (Exit value:
1) -> [Help 1]
[ERROR] 
[ERROR] To see the full stack trace of the errors, re-run Maven with the -e switch.
[ERROR] Re-run Maven using the -X switch to enable full debug logging.
[ERROR] 
[ERROR] For more information about the errors and possible solutions, please read the following
articles:
[ERROR] [Help 1] http://cwiki.apache.org/confluence/display/MAVEN/MojoExecutionException
Build step 'Execute shell' marked build as failure
ERROR: Maven JVM terminated unexpectedly with exit code 143
Archiving artifacts

Mime
View raw message