cloudstack-commits mailing list archives

Site index · List index
Message view « Date » · « Thread »
Top « Date » · « Thread »
From Apache Jenkins Server <jenk...@builds.apache.org>
Subject Build failed in Jenkins: cloudstack-marvin-41 #550
Date Tue, 09 Jul 2013 05:55:33 GMT
See <https://builds.apache.org/job/cloudstack-marvin-41/550/changes>

Changes:

[marcus] Summary: update user data on all networks a VM is connected to

[marcus] CLOUDSTACK-2083 router never comes to running state when addNicToVirtualMachine api
is called with network id which is only allocated

------------------------------------------
[...truncated 1159 lines...]

[INFO] --- maven-resources-plugin:2.5:resources (default-resources) @ cloud-plugin-api-limit-account-based
---
[INFO] [INFO] Compiling 9 source files to <https://builds.apache.org/job/cloudstack-marvin-41/ws/plugins/api/rate-limit/target/classes>

[INFO] --- maven-compiler-plugin:2.5.1:compile (default-compile) @ cloud-plugin-api-limit-account-based
---
[INFO] [debug] execute contextualize
[INFO] Using 'UTF-8' encoding to copy filtered resources.
[INFO] skip non existing resourceDirectory <https://builds.apache.org/job/cloudstack-marvin-41/ws/plugins/api/rate-limit/test/resources>
[INFO] Copying 3 resources

[INFO] --- maven-resources-plugin:2.5:testResources (default-testResources) @ cloud-plugin-api-limit-account-based
---
[INFO] [INFO] Compiling 4 source files to <https://builds.apache.org/job/cloudstack-marvin-41/ws/plugins/api/rate-limit/target/test-classes>

[INFO] --- maven-compiler-plugin:2.5.1:testCompile (default-testCompile) @ cloud-plugin-api-limit-account-based
---
[INFO] [INFO] Surefire report directory: <https://builds.apache.org/job/cloudstack-marvin-41/ws/plugins/api/rate-limit/target/surefire-reports>

-------------------------------------------------------
 T E S T S
-------------------------------------------------------

[INFO] --- maven-surefire-plugin:2.12:test (default-test) @ cloud-plugin-api-limit-account-based
---
Running org.apache.cloudstack.ratelimit.ApiRateLimitTest
log4j:WARN No appenders could be found for logger (net.sf.ehcache.CacheManager).
log4j:WARN Please initialize the log4j system properly.
log4j:WARN See http://logging.apache.org/log4j/1.2/faq.html#noconfig for more info.
Tests run: 7, Failures: 0, Errors: 0, Skipped: 0, Time elapsed: 1.753 sec

Results :

Tests run: 7, Failures: 0, Errors: 0, Skipped: 0

[JENKINS] Recording test results
[INFO] [INFO] Building jar: <https://builds.apache.org/job/cloudstack-marvin-41/ws/plugins/api/rate-limit/target/cloud-plugin-api-limit-account-based-4.1.1-SNAPSHOT.jar>

[INFO] --- maven-jar-plugin:2.4:jar (default-jar) @ cloud-plugin-api-limit-account-based ---
[INFO] 
[INFO] --- maven-site-plugin:3.1:attach-descriptor (attach-descriptor) @ cloud-plugin-api-limit-account-based
---
[INFO] Installing <https://builds.apache.org/job/cloudstack-marvin-41/ws/plugins/api/rate-limit/target/cloud-plugin-api-limit-account-based-4.1.1-SNAPSHOT.jar>
to /home/jenkins/jenkins-slave/maven-repositories/1/org/apache/cloudstack/cloud-plugin-api-limit-account-based/4.1.1-SNAPSHOT/cloud-plugin-api-limit-account-based-4.1.1-SNAPSHOT.jar
[INFO] [INFO] Installing <https://builds.apache.org/job/cloudstack-marvin-41/ws/plugins/api/rate-limit/pom.xml>
to /home/jenkins/jenkins-slave/maven-repositories/1/org/apache/cloudstack/cloud-plugin-api-limit-account-based/4.1.1-SNAPSHOT/cloud-plugin-api-limit-account-based-4.1.1-SNAPSHOT.pom

[INFO] --- maven-install-plugin:2.3.1:install (default-install) @ cloud-plugin-api-limit-account-based
---
[INFO] [INFO] Deleting <https://builds.apache.org/job/cloudstack-marvin-41/ws/plugins/api/discovery/target>
                                                                        
[INFO] ------------------------------------------------------------------------
[INFO] Building Apache CloudStack Plugin - API Discovery 4.1.1-SNAPSHOT
[INFO] ------------------------------------------------------------------------
[INFO] 
[INFO] --- maven-clean-plugin:2.5:clean (default-clean) @ cloud-plugin-api-discovery ---
[INFO] 
[INFO] --- maven-remote-resources-plugin:1.3:process (default) @ cloud-plugin-api-discovery
---
[debug] execute contextualize
[INFO] [INFO] Using 'UTF-8' encoding to copy filtered resources.
[INFO] skip non existing resourceDirectory <https://builds.apache.org/job/cloudstack-marvin-41/ws/plugins/api/discovery/src/main/resources>
[INFO] Copying 3 resources

[INFO] --- maven-resources-plugin:2.5:resources (default-resources) @ cloud-plugin-api-discovery
---
[INFO] [INFO] Compiling 6 source files to <https://builds.apache.org/job/cloudstack-marvin-41/ws/plugins/api/discovery/target/classes>

[INFO] --- maven-compiler-plugin:2.5.1:compile (default-compile) @ cloud-plugin-api-discovery
---
[INFO] [debug] execute contextualize
[INFO] Using 'UTF-8' encoding to copy filtered resources.
[INFO] skip non existing resourceDirectory <https://builds.apache.org/job/cloudstack-marvin-41/ws/plugins/api/discovery/test/resources>
[INFO] Copying 3 resources

[INFO] --- maven-resources-plugin:2.5:testResources (default-testResources) @ cloud-plugin-api-discovery
---
[INFO] [INFO] Compiling 1 source file to <https://builds.apache.org/job/cloudstack-marvin-41/ws/plugins/api/discovery/target/test-classes>

[INFO] --- maven-compiler-plugin:2.5.1:testCompile (default-testCompile) @ cloud-plugin-api-discovery
---
[INFO] [INFO] Surefire report directory: <https://builds.apache.org/job/cloudstack-marvin-41/ws/plugins/api/discovery/target/surefire-reports>

-------------------------------------------------------
 T E S T S
-------------------------------------------------------

[INFO] --- maven-surefire-plugin:2.12:test (default-test) @ cloud-plugin-api-discovery ---
Running org.apache.cloudstack.discovery.ApiDiscoveryTest
log4j:WARN No appenders could be found for logger (org.apache.cloudstack.discovery.ApiDiscoveryServiceImpl).
log4j:WARN Please initialize the log4j system properly.
log4j:WARN See http://logging.apache.org/log4j/1.2/faq.html#noconfig for more info.
Tests run: 2, Failures: 0, Errors: 0, Skipped: 0, Time elapsed: 0.331 sec

Results :

Tests run: 2, Failures: 0, Errors: 0, Skipped: 0

[JENKINS] Recording test results
[INFO] [INFO] Building jar: <https://builds.apache.org/job/cloudstack-marvin-41/ws/plugins/api/discovery/target/cloud-plugin-api-discovery-4.1.1-SNAPSHOT.jar>

[INFO] --- maven-jar-plugin:2.4:jar (default-jar) @ cloud-plugin-api-discovery ---
[INFO] 
[INFO] --- maven-site-plugin:3.1:attach-descriptor (attach-descriptor) @ cloud-plugin-api-discovery
---
[INFO] [INFO] Installing <https://builds.apache.org/job/cloudstack-marvin-41/ws/plugins/api/discovery/target/cloud-plugin-api-discovery-4.1.1-SNAPSHOT.jar>
to /home/jenkins/jenkins-slave/maven-repositories/1/org/apache/cloudstack/cloud-plugin-api-discovery/4.1.1-SNAPSHOT/cloud-plugin-api-discovery-4.1.1-SNAPSHOT.jar

[INFO] --- maven-install-plugin:2.3.1:install (default-install) @ cloud-plugin-api-discovery
---
[INFO] Installing <https://builds.apache.org/job/cloudstack-marvin-41/ws/plugins/api/discovery/pom.xml>
to /home/jenkins/jenkins-slave/maven-repositories/1/org/apache/cloudstack/cloud-plugin-api-discovery/4.1.1-SNAPSHOT/cloud-plugin-api-discovery-4.1.1-SNAPSHOT.pom
[INFO]                                                                         
[INFO] ------------------------------------------------------------------------
[INFO] Building Apache CloudStack Plugin - ACL Static Role Based 4.1.1-SNAPSHOT
[INFO] ------------------------------------------------------------------------
[INFO] Deleting <https://builds.apache.org/job/cloudstack-marvin-41/ws/plugins/acl/static-role-based/target>
[INFO] 
[INFO] --- maven-clean-plugin:2.5:clean (default-clean) @ cloud-plugin-acl-static-role-based
---
[INFO] 
[INFO] --- maven-remote-resources-plugin:1.3:process (default) @ cloud-plugin-acl-static-role-based
---
[INFO] [debug] execute contextualize
[INFO] Using 'UTF-8' encoding to copy filtered resources.
[INFO] skip non existing resourceDirectory <https://builds.apache.org/job/cloudstack-marvin-41/ws/plugins/acl/static-role-based/src/main/resources>
[INFO] Copying 3 resources

[INFO] --- maven-resources-plugin:2.5:resources (default-resources) @ cloud-plugin-acl-static-role-based
---
[INFO] [INFO] Compiling 1 source file to <https://builds.apache.org/job/cloudstack-marvin-41/ws/plugins/acl/static-role-based/target/classes>

[INFO] --- maven-compiler-plugin:2.5.1:compile (default-compile) @ cloud-plugin-acl-static-role-based
---
[debug] execute contextualize
[INFO] [INFO] Using 'UTF-8' encoding to copy filtered resources.
[INFO] skip non existing resourceDirectory <https://builds.apache.org/job/cloudstack-marvin-41/ws/plugins/acl/static-role-based/src/test/resources>
[INFO] Copying 3 resources

[INFO] --- maven-resources-plugin:2.5:testResources (default-testResources) @ cloud-plugin-acl-static-role-based
---
[INFO] [INFO] No sources to compile

[INFO] --- maven-compiler-plugin:2.5.1:testCompile (default-testCompile) @ cloud-plugin-acl-static-role-based
---
[INFO] [INFO] Surefire report directory: <https://builds.apache.org/job/cloudstack-marvin-41/ws/plugins/acl/static-role-based/target/surefire-reports>

-------------------------------------------------------
 T E S T S
-------------------------------------------------------

[INFO] --- maven-surefire-plugin:2.12:test (default-test) @ cloud-plugin-acl-static-role-based
---

Results :

Tests run: 0, Failures: 0, Errors: 0, Skipped: 0

[JENKINS] Recording test results
[INFO] [INFO] Building jar: <https://builds.apache.org/job/cloudstack-marvin-41/ws/plugins/acl/static-role-based/target/cloud-plugin-acl-static-role-based-4.1.1-SNAPSHOT.jar>

[INFO] --- maven-jar-plugin:2.4:jar (default-jar) @ cloud-plugin-acl-static-role-based ---
[INFO] 
[INFO] --- maven-site-plugin:3.1:attach-descriptor (attach-descriptor) @ cloud-plugin-acl-static-role-based
---
[INFO] Installing <https://builds.apache.org/job/cloudstack-marvin-41/ws/plugins/acl/static-role-based/target/cloud-plugin-acl-static-role-based-4.1.1-SNAPSHOT.jar>
to /home/jenkins/jenkins-slave/maven-repositories/1/org/apache/cloudstack/cloud-plugin-acl-static-role-based/4.1.1-SNAPSHOT/cloud-plugin-acl-static-role-based-4.1.1-SNAPSHOT.jar
[INFO] [INFO] Installing <https://builds.apache.org/job/cloudstack-marvin-41/ws/plugins/acl/static-role-based/pom.xml>
to /home/jenkins/jenkins-slave/maven-repositories/1/org/apache/cloudstack/cloud-plugin-acl-static-role-based/4.1.1-SNAPSHOT/cloud-plugin-acl-static-role-based-4.1.1-SNAPSHOT.pom

[INFO] --- maven-install-plugin:2.3.1:install (default-install) @ cloud-plugin-acl-static-role-based
---
[INFO]                                                                         
[INFO] ------------------------------------------------------------------------
[INFO] Deleting <https://builds.apache.org/job/cloudstack-marvin-41/ws/plugins/deployment-planners/user-concentrated-pod/target>
[INFO] Building Apache CloudStack Plugin - User Concentrated Pod Deployment Planner 4.1.1-SNAPSHOT
[INFO] ------------------------------------------------------------------------
[INFO] 
[INFO] --- maven-clean-plugin:2.5:clean (default-clean) @ cloud-plugin-planner-user-concentrated-pod
---
[INFO] 
[INFO] --- maven-remote-resources-plugin:1.3:process (default) @ cloud-plugin-planner-user-concentrated-pod
---
[debug] execute contextualize
[INFO] [INFO] Using 'UTF-8' encoding to copy filtered resources.
[INFO] skip non existing resourceDirectory <https://builds.apache.org/job/cloudstack-marvin-41/ws/plugins/deployment-planners/user-concentrated-pod/src/main/resources>
[INFO] Copying 3 resources

[INFO] --- maven-resources-plugin:2.5:resources (default-resources) @ cloud-plugin-planner-user-concentrated-pod
---
[INFO] [INFO] Compiling 1 source file to <https://builds.apache.org/job/cloudstack-marvin-41/ws/plugins/deployment-planners/user-concentrated-pod/target/classes>

[INFO] --- maven-compiler-plugin:2.5.1:compile (default-compile) @ cloud-plugin-planner-user-concentrated-pod
---
[debug] execute contextualize
[INFO] [INFO] Using 'UTF-8' encoding to copy filtered resources.
[INFO] skip non existing resourceDirectory <https://builds.apache.org/job/cloudstack-marvin-41/ws/plugins/deployment-planners/user-concentrated-pod/src/test/resources>
[INFO] Copying 3 resources

[INFO] --- maven-resources-plugin:2.5:testResources (default-testResources) @ cloud-plugin-planner-user-concentrated-pod
---
[INFO] [INFO] No sources to compile

[INFO] --- maven-compiler-plugin:2.5.1:testCompile (default-testCompile) @ cloud-plugin-planner-user-concentrated-pod
---
[INFO] [INFO] Surefire report directory: <https://builds.apache.org/job/cloudstack-marvin-41/ws/plugins/deployment-planners/user-concentrated-pod/target/surefire-reports>

-------------------------------------------------------
 T E S T S
-------------------------------------------------------

[INFO] --- maven-surefire-plugin:2.12:test (default-test) @ cloud-plugin-planner-user-concentrated-pod
---

Results :

Tests run: 0, Failures: 0, Errors: 0, Skipped: 0

[JENKINS] Recording test results
[INFO] [INFO] Building jar: <https://builds.apache.org/job/cloudstack-marvin-41/ws/plugins/deployment-planners/user-concentrated-pod/target/cloud-plugin-planner-user-concentrated-pod-4.1.1-SNAPSHOT.jar>

[INFO] --- maven-jar-plugin:2.4:jar (default-jar) @ cloud-plugin-planner-user-concentrated-pod
---
[INFO] 
[INFO] --- maven-site-plugin:3.1:attach-descriptor (attach-descriptor) @ cloud-plugin-planner-user-concentrated-pod
---
[INFO] [INFO] Installing <https://builds.apache.org/job/cloudstack-marvin-41/ws/plugins/deployment-planners/user-concentrated-pod/target/cloud-plugin-planner-user-concentrated-pod-4.1.1-SNAPSHOT.jar>
to /home/jenkins/jenkins-slave/maven-repositories/1/org/apache/cloudstack/cloud-plugin-planner-user-concentrated-pod/4.1.1-SNAPSHOT/cloud-plugin-planner-user-concentrated-pod-4.1.1-SNAPSHOT.jar
[INFO] Installing <https://builds.apache.org/job/cloudstack-marvin-41/ws/plugins/deployment-planners/user-concentrated-pod/pom.xml>
to /home/jenkins/jenkins-slave/maven-repositories/1/org/apache/cloudstack/cloud-plugin-planner-user-concentrated-pod/4.1.1-SNAPSHOT/cloud-plugin-planner-user-concentrated-pod-4.1.1-SNAPSHOT.pom

[INFO] --- maven-install-plugin:2.3.1:install (default-install) @ cloud-plugin-planner-user-concentrated-pod
---
[INFO] [INFO] Deleting <https://builds.apache.org/job/cloudstack-marvin-41/ws/plugins/deployment-planners/user-dispersing/target>
                                                                        
[INFO] ------------------------------------------------------------------------
[INFO] Building Apache CloudStack Plugin - User Dispersing Deployment Planner 4.1.1-SNAPSHOT
[INFO] ------------------------------------------------------------------------
[INFO] 
[INFO] --- maven-clean-plugin:2.5:clean (default-clean) @ cloud-plugin-planner-user-dispersing
---
[INFO] 
[INFO] --- maven-remote-resources-plugin:1.3:process (default) @ cloud-plugin-planner-user-dispersing
---
[INFO] [debug] execute contextualize
[INFO] Using 'UTF-8' encoding to copy filtered resources.
[INFO] skip non existing resourceDirectory <https://builds.apache.org/job/cloudstack-marvin-41/ws/plugins/deployment-planners/user-dispersing/src/main/resources>
[INFO] Copying 3 resources

[INFO] --- maven-resources-plugin:2.5:resources (default-resources) @ cloud-plugin-planner-user-dispersing
---
[INFO] [INFO] Compiling 1 source file to <https://builds.apache.org/job/cloudstack-marvin-41/ws/plugins/deployment-planners/user-dispersing/target/classes>

[INFO] --- maven-compiler-plugin:2.5.1:compile (default-compile) @ cloud-plugin-planner-user-dispersing
---
[cloudstack-marvin-41] $ /bin/bash -xe /tmp/hudson4088188654205578902.sh
+ mvn -P developer -pl :cloud-apidoc -pl :cloud-marvin
[INFO] Scanning for projects...
[INFO] ------------------------------------------------------------------------
[INFO] Reactor Build Order:
[INFO] 
[INFO] Apache CloudStack apidoc Tools
[INFO] Apache CloudStack Developer Tools: marvin
[INFO]                                                                         
[INFO] ------------------------------------------------------------------------
[INFO] Building Apache CloudStack apidoc Tools 4.1.1-SNAPSHOT
[INFO] ------------------------------------------------------------------------
Downloading: http://repository.apache.org/snapshots/org/apache/cloudstack/cloud-client-ui/4.1.1-SNAPSHOT/maven-metadata.xml

Downloading: http://repository.apache.org/snapshots/org/apache/cloudstack/cloud-client-ui/4.1.1-SNAPSHOT/cloud-client-ui-4.1.1-SNAPSHOT.war

[INFO] ------------------------------------------------------------------------
[INFO] Reactor Summary:
[INFO] 
[INFO] Apache CloudStack apidoc Tools .................... FAILURE [2.001s]
[INFO] Apache CloudStack Developer Tools: marvin ......... SKIPPED
[INFO] ------------------------------------------------------------------------
[INFO] BUILD FAILURE
[INFO] ------------------------------------------------------------------------
[INFO] Total time: 3.177s
[INFO] Finished at: Tue Jul 09 05:55:32 UTC 2013
[INFO] Final Memory: 12M/79M
[INFO] ------------------------------------------------------------------------
[ERROR] Failed to execute goal on project cloud-apidoc: Could not resolve dependencies for
project org.apache.cloudstack:cloud-apidoc:pom:4.1.1-SNAPSHOT: Could not find artifact org.apache.cloudstack:cloud-client-ui:war:4.1.1-SNAPSHOT
in Nexus (http://repository.apache.org/snapshots) -> [Help 1]
[ERROR] 
[ERROR] To see the full stack trace of the errors, re-run Maven with the -e switch.
[ERROR] Re-run Maven using the -X switch to enable full debug logging.
[ERROR] 
[ERROR] For more information about the errors and possible solutions, please read the following
articles:
[ERROR] [Help 1] http://cwiki.apache.org/confluence/display/MAVEN/DependencyResolutionException
Build step 'Execute shell' marked build as failure
ERROR: Maven JVM terminated unexpectedly with exit code 143
Archiving artifacts

Mime
View raw message