cloudstack-commits mailing list archives

Site index · List index
Message view « Date » · « Thread »
Top « Date » · « Thread »
From Apache Jenkins Server <jenk...@builds.apache.org>
Subject Build failed in Jenkins: cloudstack-apidocs-master #1332
Date Sat, 27 Jul 2013 02:11:04 GMT
See <https://builds.apache.org/job/cloudstack-apidocs-master/1332/changes>

Changes:

[min.chen] CLOUDSTACK-3857:[Object_Store_Refactor][Usage] Two VOLUME_CREATE usage

------------------------------------------
[...truncated 1696 lines...]
INFO: Apache CloudStack Plugin - Storage Image default provider  SKIPPED
Jul 27, 2013 1:39:54 AM org.apache.maven.cli.event.ExecutionEventLogger logReactorSummary
INFO: Apache CloudStack Plugin - Storage Image sample provider  SKIPPED
Jul 27, 2013 1:39:54 AM org.apache.maven.cli.event.ExecutionEventLogger logReactorSummary
INFO: Apache CloudStack Plugin - Storage Volume SolidFire Provider  SKIPPED
Jul 27, 2013 1:39:54 AM org.apache.maven.cli.event.ExecutionEventLogger logReactorSummary
INFO: Apache CloudStack Plugin - Storage Volume default provider  SKIPPED
Jul 27, 2013 1:39:54 AM org.apache.maven.cli.event.ExecutionEventLogger logReactorSummary
INFO: Apache CloudStack Plugin - Storage Volume sample provider  SKIPPED
Jul 27, 2013 1:39:54 AM org.apache.maven.cli.event.ExecutionEventLogger logReactorSummary
INFO: Apache CloudStack Plugin - SNMP Alerts ............ SKIPPED
Jul 27, 2013 1:39:54 AM org.apache.maven.cli.event.ExecutionEventLogger logReactorSummary
INFO: Apache CloudStack Plugin - Syslog Alerts .......... SKIPPED
Jul 27, 2013 1:39:54 AM org.apache.maven.cli.event.ExecutionEventLogger logReactorSummary
INFO: Apache CloudStack Plugin - Network Internal Load Balancer  SKIPPED
Jul 27, 2013 1:39:54 AM org.apache.maven.cli.event.ExecutionEventLogger logReactorSummary
INFO: Apache CloudStack Test ............................ SKIPPED
Jul 27, 2013 1:39:54 AM org.apache.maven.cli.event.ExecutionEventLogger logReactorSummary
INFO: Apache CloudStack Console Proxy Service ........... SKIPPED
Jul 27, 2013 1:39:54 AM org.apache.maven.cli.event.ExecutionEventLogger logReactorSummary
INFO: Apache CloudStack Console Proxy ................... SKIPPED
Jul 27, 2013 1:39:54 AM org.apache.maven.cli.event.ExecutionEventLogger logReactorSummary
INFO: Apache CloudStack Client UI ....................... SKIPPED
Jul 27, 2013 1:39:54 AM org.apache.maven.cli.event.ExecutionEventLogger logReactorSummary
INFO: Apache CloudStack Console Proxy Plugin ............ SKIPPED
Jul 27, 2013 1:39:54 AM org.apache.maven.cli.event.ExecutionEventLogger logResult
INFO: ------------------------------------------------------------------------
Jul 27, 2013 1:39:54 AM org.apache.maven.cli.event.ExecutionEventLogger logResult
INFO: BUILD FAILURE
Jul 27, 2013 1:39:54 AM org.apache.maven.cli.event.ExecutionEventLogger logStats
INFO: ------------------------------------------------------------------------
Jul 27, 2013 1:39:54 AM org.apache.maven.cli.event.ExecutionEventLogger logStats
INFO: Total time: 2:23.667s
Jul 27, 2013 1:39:54 AM org.apache.maven.cli.event.ExecutionEventLogger logStats
INFO: Finished at: Sat Jul 27 01:39:54 UTC 2013
Jul 27, 2013 1:39:55 AM org.apache.maven.cli.event.ExecutionEventLogger logStats
INFO: Final Memory: 30M/189M
Jul 27, 2013 1:39:55 AM org.apache.maven.cli.event.ExecutionEventLogger sessionEnded
INFO: ------------------------------------------------------------------------
[JENKINS] Archiving disabled
[JENKINS] Archiving disabled
[JENKINS] Archiving disabled
[JENKINS] Archiving disabled
[JENKINS] Archiving disabled
[JENKINS] Archiving disabled
[JENKINS] Archiving disabled
[JENKINS] Archiving disabled
[JENKINS] Archiving disabled
[JENKINS] Archiving disabled
[JENKINS] Archiving disabled
[JENKINS] Archiving disabled
[JENKINS] Archiving disabled
[JENKINS] Archiving disabled
[JENKINS] Archiving disabled
[JENKINS] Archiving disabled
[JENKINS] Archiving disabled
[JENKINS] Archiving disabled
[JENKINS] Archiving disabled
[JENKINS] Archiving disabled
[JENKINS] Archiving disabled
[JENKINS] Archiving disabled
[JENKINS] Archiving disabled
[JENKINS] Archiving disabled
[JENKINS] Archiving disabled
[JENKINS] Archiving disabled
[JENKINS] Archiving disabled
[JENKINS] Archiving disabled
[JENKINS] Archiving disabled
[JENKINS] Archiving disabled
[JENKINS] Archiving disabled
[JENKINS] Archiving disabled
[JENKINS] Archiving disabled
[JENKINS] Archiving disabled
[JENKINS] Archiving disabled
[JENKINS] Archiving disabled
[JENKINS] Archiving disabled
[JENKINS] Archiving disabled
[JENKINS] Archiving disabled
[JENKINS] Archiving disabled
[JENKINS] Archiving disabled
[JENKINS] Archiving disabled
[JENKINS] Archiving disabled
[JENKINS] Archiving disabled
[JENKINS] Archiving disabled
[JENKINS] Archiving disabled
[JENKINS] Archiving disabled
[JENKINS] Archiving disabled
[JENKINS] Archiving disabled
[JENKINS] Archiving disabled
[JENKINS] Archiving disabled
[JENKINS] Archiving disabled
[JENKINS] Archiving disabled
[JENKINS] Archiving disabled
[JENKINS] Archiving disabled
[JENKINS] Archiving disabled
[JENKINS] Archiving disabled
[JENKINS] Archiving disabled
[JENKINS] Archiving disabled
[JENKINS] Archiving disabled
[JENKINS] Archiving disabled
[JENKINS] Archiving disabled
[JENKINS] Archiving disabled
[JENKINS] Archiving disabled
[JENKINS] Archiving disabled
[JENKINS] Archiving disabled
[JENKINS] Archiving disabled
[JENKINS] Archiving disabled
[JENKINS] Archiving disabled
[JENKINS] Archiving disabled
[JENKINS] Archiving disabled
[JENKINS] Archiving disabled
[JENKINS] Archiving disabled
[JENKINS] Archiving disabled
[JENKINS] Archiving disabled
[JENKINS] Archiving disabled
Waiting for Jenkins to finish collecting data
mavenExecutionResult exceptions not empty
message : Failed to execute goal org.apache.maven.plugins:maven-surefire-plugin:2.12:test
(default-test) on project cloud-server: Error occurred in starting fork, check output in log
cause : Error occurred in starting fork, check output in log
Stack trace : 
org.apache.maven.lifecycle.LifecycleExecutionException: Failed to execute goal org.apache.maven.plugins:maven-surefire-plugin:2.12:test
(default-test) on project cloud-server: Error occurred in starting fork, check output in log
	at org.apache.maven.lifecycle.internal.MojoExecutor.execute(MojoExecutor.java:217)
	at org.apache.maven.lifecycle.internal.MojoExecutor.execute(MojoExecutor.java:153)
	at org.apache.maven.lifecycle.internal.MojoExecutor.execute(MojoExecutor.java:145)
	at org.apache.maven.lifecycle.internal.LifecycleModuleBuilder.buildProject(LifecycleModuleBuilder.java:84)
	at org.apache.maven.lifecycle.internal.LifecycleModuleBuilder.buildProject(LifecycleModuleBuilder.java:59)
	at org.apache.maven.lifecycle.internal.LifecycleStarter.singleThreadedBuild(LifecycleStarter.java:183)
	at org.apache.maven.lifecycle.internal.LifecycleStarter.execute(LifecycleStarter.java:161)
	at org.apache.maven.DefaultMaven.doExecute(DefaultMaven.java:320)
	at org.apache.maven.DefaultMaven.execute(DefaultMaven.java:156)
	at org.jvnet.hudson.maven3.launcher.Maven3Launcher.main(Maven3Launcher.java:117)
	at sun.reflect.NativeMethodAccessorImpl.invoke0(Native Method)
	at sun.reflect.NativeMethodAccessorImpl.invoke(NativeMethodAccessorImpl.java:39)
	at sun.reflect.DelegatingMethodAccessorImpl.invoke(DelegatingMethodAccessorImpl.java:25)
	at java.lang.reflect.Method.invoke(Method.java:597)
	at org.codehaus.plexus.classworlds.launcher.Launcher.launchStandard(Launcher.java:329)
	at org.codehaus.plexus.classworlds.launcher.Launcher.launch(Launcher.java:239)
	at org.jvnet.hudson.maven3.agent.Maven3Main.launch(Maven3Main.java:178)
	at sun.reflect.NativeMethodAccessorImpl.invoke0(Native Method)
	at sun.reflect.NativeMethodAccessorImpl.invoke(NativeMethodAccessorImpl.java:39)
	at sun.reflect.DelegatingMethodAccessorImpl.invoke(DelegatingMethodAccessorImpl.java:25)
	at java.lang.reflect.Method.invoke(Method.java:597)
	at hudson.maven.Maven3Builder.call(Maven3Builder.java:129)
	at hudson.maven.Maven3Builder.call(Maven3Builder.java:67)
	at hudson.remoting.UserRequest.perform(UserRequest.java:118)
	at hudson.remoting.UserRequest.perform(UserRequest.java:48)
	at hudson.remoting.Request$2.run(Request.java:326)
	at hudson.remoting.InterceptingExecutorService$1.call(InterceptingExecutorService.java:72)
	at java.util.concurrent.FutureTask$Sync.innerRun(FutureTask.java:303)
	at java.util.concurrent.FutureTask.run(FutureTask.java:138)
	at java.util.concurrent.ThreadPoolExecutor$Worker.runTask(ThreadPoolExecutor.java:895)
	at java.util.concurrent.ThreadPoolExecutor$Worker.run(ThreadPoolExecutor.java:918)
	at java.lang.Thread.run(Thread.java:662)
Caused by: org.apache.maven.plugin.MojoExecutionException: Error occurred in starting fork,
check output in log
	at org.apache.maven.plugin.surefire.SurefirePlugin.assertNoException(SurefirePlugin.java:656)
	at org.apache.maven.plugin.surefire.SurefirePlugin.handleSummary(SurefirePlugin.java:645)
	at org.apache.maven.plugin.surefire.AbstractSurefireMojo.executeAfterPreconditionsChecked(AbstractSurefireMojo.java:137)
	at org.apache.maven.plugin.surefire.AbstractSurefireMojo.execute(AbstractSurefireMojo.java:98)
	at org.apache.maven.plugin.DefaultBuildPluginManager.executeMojo(DefaultBuildPluginManager.java:101)
	at org.apache.maven.lifecycle.internal.MojoExecutor.execute(MojoExecutor.java:209)
	... 31 more
Caused by: org.apache.maven.surefire.booter.SurefireBooterForkException: Error occurred in
starting fork, check output in log
	at org.apache.maven.plugin.surefire.booterclient.ForkStarter.fork(ForkStarter.java:281)
	at org.apache.maven.plugin.surefire.booterclient.ForkStarter.run(ForkStarter.java:113)
	at org.apache.maven.plugin.surefire.AbstractSurefireMojo.executeProvider(AbstractSurefireMojo.java:199)
	at org.apache.maven.plugin.surefire.AbstractSurefireMojo.executeAllProviders(AbstractSurefireMojo.java:176)
	at org.apache.maven.plugin.surefire.AbstractSurefireMojo.executeAfterPreconditionsChecked(AbstractSurefireMojo.java:135)
	... 34 more
channel stopped
[cloudstack-apidocs-master] $ /bin/bash -xe /tmp/hudson3632840100577941071.sh
+ mvn -P developer -pl :cloud-apidoc
[INFO] Scanning for projects...
[INFO]                                                                         
[INFO] ------------------------------------------------------------------------
[INFO] Building Apache CloudStack apidocs 4.2.0-SNAPSHOT
[INFO] ------------------------------------------------------------------------
[INFO] 
[INFO] --- maven-remote-resources-plugin:1.3:process (default) @ cloud-apidoc ---
[INFO] 
[INFO] --- exec-maven-plugin:1.2.1:exec (compile) @ cloud-apidoc ---
Check, is this api part of another build profile? Null value for key: addVmwareDc preProcessedCommand=1
Check, is this api part of another build profile? Null value for key: removeVmwareDc preProcessedCommand=1
Check, is this api part of another build profile? Null value for key: listVmwareDcs preProcessedCommand=1
Check, is this api part of another build profile? Null value for key: deleteCiscoNexusVSM
preProcessedCommand=1
Check, is this api part of another build profile? Null value for key: enableCiscoNexusVSM
preProcessedCommand=1
Check, is this api part of another build profile? Null value for key: disableCiscoNexusVSM
preProcessedCommand=1
Check, is this api part of another build profile? Null value for key: listCiscoNexusVSMs preProcessedCommand=1
Check, is this api part of another build profile? Null value for key: addExternalLoadBalancer
preProcessedCommand=1
Check, is this api part of another build profile? Null value for key: deleteExternalLoadBalancer
preProcessedCommand=1
Check, is this api part of another build profile? Null value for key: listExternalLoadBalancers
preProcessedCommand=1
Check, is this api part of another build profile? Null value for key: addF5LoadBalancer preProcessedCommand=1
Check, is this api part of another build profile? Null value for key: configureF5LoadBalancer
preProcessedCommand=1
Check, is this api part of another build profile? Null value for key: deleteF5LoadBalancer
preProcessedCommand=1
Check, is this api part of another build profile? Null value for key: listF5LoadBalancers
preProcessedCommand=1
Check, is this api part of another build profile? Null value for key: listF5LoadBalancerNetworks
preProcessedCommand=1
Check, is this api part of another build profile? Null value for key: addExternalFirewall
preProcessedCommand=1
Check, is this api part of another build profile? Null value for key: deleteExternalFirewall
preProcessedCommand=1
Check, is this api part of another build profile? Null value for key: listExternalFirewalls
preProcessedCommand=1
Check, is this api part of another build profile? Null value for key: addSrxFirewall preProcessedCommand=1
Check, is this api part of another build profile? Null value for key: deleteSrxFirewall preProcessedCommand=1
Check, is this api part of another build profile? Null value for key: configureSrxFirewall
preProcessedCommand=1
Check, is this api part of another build profile? Null value for key: listSrxFirewalls preProcessedCommand=1
Check, is this api part of another build profile? Null value for key: listSrxFirewallNetworks
preProcessedCommand=1
Check, is this api part of another build profile? Null value for key: createVolumeOnFiler
preProcessedCommand=15
Check, is this api part of another build profile? Null value for key: destroyVolumeOnFiler
preProcessedCommand=15
Check, is this api part of another build profile? Null value for key: listVolumesOnFiler preProcessedCommand=15
Check, is this api part of another build profile? Null value for key: createLunOnFiler preProcessedCommand=15
Check, is this api part of another build profile? Null value for key: destroyLunOnFiler preProcessedCommand=15
Check, is this api part of another build profile? Null value for key: listLunsOnFiler preProcessedCommand=15
Check, is this api part of another build profile? Null value for key: associateLun preProcessedCommand=15
Check, is this api part of another build profile? Null value for key: dissociateLun preProcessedCommand=15
Check, is this api part of another build profile? Null value for key: createPool preProcessedCommand=15
Check, is this api part of another build profile? Null value for key: deletePool preProcessedCommand=15
Check, is this api part of another build profile? Null value for key: modifyPool preProcessedCommand=15
Check, is this api part of another build profile? Null value for key: listPools preProcessedCommand=15
Check, is this api part of another build profile? Null value for key: addNetscalerLoadBalancer
preProcessedCommand=1
Check, is this api part of another build profile? Null value for key: deleteNetscalerLoadBalancer
preProcessedCommand=1
Check, is this api part of another build profile? Null value for key: configureNetscalerLoadBalancer
preProcessedCommand=1
Check, is this api part of another build profile? Null value for key: listNetscalerLoadBalancers
preProcessedCommand=1
Check, is this api part of another build profile? Null value for key: listNetscalerLoadBalancerNetworks
preProcessedCommand=1
Check, is this api part of another build profile? Null value for key: configureSimulator preProcessedCommand=1
Check, is this api part of another build profile? Null value for key: addCiscoVnmcResource
preProcessedCommand=1
Check, is this api part of another build profile? Null value for key: deleteCiscoVnmcResource
preProcessedCommand=1
Check, is this api part of another build profile? Null value for key: listCiscoVnmcResources
preProcessedCommand=1
Check, is this api part of another build profile? Null value for key: addCiscoAsa1000vResource
preProcessedCommand=1
Check, is this api part of another build profile? Null value for key: deleteCiscoAsa1000vResource
preProcessedCommand=1
Check, is this api part of another build profile? Null value for key: listCiscoAsa1000vResources
preProcessedCommand=1
Traceback (most recent call last):
  File "<https://builds.apache.org/job/cloudstack-apidocs-master/ws/tools/apidoc/gen_toc.py",>
line 190, in <module>
    category = choose_category(fn)
  File "<https://builds.apache.org/job/cloudstack-apidocs-master/ws/tools/apidoc/gen_toc.py",>
line 170, in choose_category
    (fn, __file__))
Exception: Need to add a category for createCacheStore.xml to <https://builds.apache.org/job/cloudstack-apidocs-master/ws/tools/apidoc/gen_toc.py>:known_categories
[INFO] ------------------------------------------------------------------------
[INFO] BUILD FAILURE
[INFO] ------------------------------------------------------------------------
[INFO] Total time: 14.086s
[INFO] Finished at: Sat Jul 27 02:11:02 UTC 2013
[INFO] Final Memory: 18M/115M
[INFO] ------------------------------------------------------------------------
[ERROR] Failed to execute goal org.codehaus.mojo:exec-maven-plugin:1.2.1:exec (compile) on
project cloud-apidoc: Command execution failed. Process exited with an error: 1 (Exit value:
1) -> [Help 1]
[ERROR] 
[ERROR] To see the full stack trace of the errors, re-run Maven with the -e switch.
[ERROR] Re-run Maven using the -X switch to enable full debug logging.
[ERROR] 
[ERROR] For more information about the errors and possible solutions, please read the following
articles:
[ERROR] [Help 1] http://cwiki.apache.org/confluence/display/MAVEN/MojoExecutionException
Build step 'Execute shell' marked build as failure
Archiving artifacts

Mime
View raw message