cloudstack-commits mailing list archives

Site index · List index
Message view « Date » · « Thread »
Top « Date » · « Thread »
From Apache Jenkins Server <jenk...@builds.apache.org>
Subject Build failed in Jenkins: cloudstack-apidocs-master #1401
Date Tue, 30 Jul 2013 18:48:45 GMT
See <https://builds.apache.org/job/cloudstack-apidocs-master/1401/changes>

Changes:

[alena.prokharchyk] CLOUDSTACK-3902: createVpcOffering - throw an excpetion when sourceNat
service is not passed in

[runseb] [GSOC] Mesos integration mid-term report

[marcus] Summary: Fix null pointer and op_networks blocker to account cleanup

[alena.prokharchyk] CLOUDSTACK-3936: db upgrade - added upgrade path from CCP 2.2.15,2.2.16
to CS 4.2

[jessicawang] CLOUDSTACK-2990: UI > scale up VM dialog - add description 'For VMware-based
Linux VMs, please read the dynamic scaling section in the admin guide before scaling.'

[frank.zhang] CloudStack CLOUDSTACK-1812

[brian.federle] CLOUDSTACK-3531: Add isrouting checkbox to register template dialog

[alena.prokharchyk] CLOUDSTACK-3958: listProjectAccounts - return account info only; user
info can be extracted from listUsers&accountId command

------------------------------------------
[...truncated 1635 lines...]
Jul 30, 2013 6:26:59 PM org.apache.maven.cli.event.ExecutionEventLogger logReactorSummary
INFO: Apache CloudStack Plugin - Storage Volume sample provider  SKIPPED
Jul 30, 2013 6:26:59 PM org.apache.maven.cli.event.ExecutionEventLogger logReactorSummary
INFO: Apache CloudStack Plugin - SNMP Alerts ............ SKIPPED
Jul 30, 2013 6:26:59 PM org.apache.maven.cli.event.ExecutionEventLogger logReactorSummary
INFO: Apache CloudStack Plugin - Syslog Alerts .......... SKIPPED
Jul 30, 2013 6:26:59 PM org.apache.maven.cli.event.ExecutionEventLogger logReactorSummary
INFO: Apache CloudStack Plugin - Network Internal Load Balancer  SKIPPED
Jul 30, 2013 6:26:59 PM org.apache.maven.cli.event.ExecutionEventLogger logReactorSummary
INFO: Apache CloudStack Test ............................ SKIPPED
Jul 30, 2013 6:26:59 PM org.apache.maven.cli.event.ExecutionEventLogger logReactorSummary
INFO: Apache CloudStack Console Proxy Service ........... SKIPPED
Jul 30, 2013 6:26:59 PM org.apache.maven.cli.event.ExecutionEventLogger logReactorSummary
INFO: Apache CloudStack Console Proxy ................... SKIPPED
Jul 30, 2013 6:26:59 PM org.apache.maven.cli.event.ExecutionEventLogger logReactorSummary
INFO: Apache CloudStack Client UI ....................... SKIPPED
Jul 30, 2013 6:26:59 PM org.apache.maven.cli.event.ExecutionEventLogger logReactorSummary
INFO: Apache CloudStack Console Proxy Plugin ............ SKIPPED
Jul 30, 2013 6:26:59 PM org.apache.maven.cli.event.ExecutionEventLogger logResult
INFO: ------------------------------------------------------------------------
Jul 30, 2013 6:26:59 PM org.apache.maven.cli.event.ExecutionEventLogger logResult
INFO: BUILD FAILURE
Jul 30, 2013 6:26:59 PM org.apache.maven.cli.event.ExecutionEventLogger logStats
INFO: ------------------------------------------------------------------------
Jul 30, 2013 6:26:59 PM org.apache.maven.cli.event.ExecutionEventLogger logStats
INFO: Total time: 1:04.407s
Jul 30, 2013 6:26:59 PM org.apache.maven.cli.event.ExecutionEventLogger logStats
INFO: Finished at: Tue Jul 30 18:26:59 UTC 2013
Jul 30, 2013 6:26:59 PM org.apache.maven.cli.event.ExecutionEventLogger logStats
INFO: Final Memory: 29M/97M
Jul 30, 2013 6:26:59 PM org.apache.maven.cli.event.ExecutionEventLogger sessionEnded
INFO: ------------------------------------------------------------------------
[JENKINS] Archiving disabled
[JENKINS] Archiving disabled
[JENKINS] Archiving disabled
[JENKINS] Archiving disabled
[JENKINS] Archiving disabled
[JENKINS] Archiving disabled
[JENKINS] Archiving disabled
[JENKINS] Archiving disabled
[JENKINS] Archiving disabled
[JENKINS] Archiving disabled
[JENKINS] Archiving disabled
[JENKINS] Archiving disabled
[JENKINS] Archiving disabled
[JENKINS] Archiving disabled
[JENKINS] Archiving disabled
[JENKINS] Archiving disabled
[JENKINS] Archiving disabled
[JENKINS] Archiving disabled
[JENKINS] Archiving disabled
[JENKINS] Archiving disabled
[JENKINS] Archiving disabled
[JENKINS] Archiving disabled
[JENKINS] Archiving disabled
[JENKINS] Archiving disabled
[JENKINS] Archiving disabled
[JENKINS] Archiving disabled
[JENKINS] Archiving disabled
[JENKINS] Archiving disabled
[JENKINS] Archiving disabled
[JENKINS] Archiving disabled
[JENKINS] Archiving disabled
[JENKINS] Archiving disabled
[JENKINS] Archiving disabled
[JENKINS] Archiving disabled
[JENKINS] Archiving disabled
[JENKINS] Archiving disabled
[JENKINS] Archiving disabled
[JENKINS] Archiving disabled
[JENKINS] Archiving disabled
[JENKINS] Archiving disabled
[JENKINS] Archiving disabled
[JENKINS] Archiving disabled
[JENKINS] Archiving disabled
[JENKINS] Archiving disabled
[JENKINS] Archiving disabled
[JENKINS] Archiving disabled
[JENKINS] Archiving disabled
[JENKINS] Archiving disabled
[JENKINS] Archiving disabled
[JENKINS] Archiving disabled
[JENKINS] Archiving disabled
[JENKINS] Archiving disabled
[JENKINS] Archiving disabled
[JENKINS] Archiving disabled
[JENKINS] Archiving disabled
[JENKINS] Archiving disabled
[JENKINS] Archiving disabled
[JENKINS] Archiving disabled
[JENKINS] Archiving disabled
[JENKINS] Archiving disabled
[JENKINS] Archiving disabled
[JENKINS] Archiving disabled
[JENKINS] Archiving disabled
[JENKINS] Archiving disabled
[JENKINS] Archiving disabled
[JENKINS] Archiving disabled
[JENKINS] Archiving disabled
[JENKINS] Archiving disabled
[JENKINS] Archiving disabled
[JENKINS] Archiving disabled
[JENKINS] Archiving disabled
[JENKINS] Archiving disabled
[JENKINS] Archiving disabled
[JENKINS] Archiving disabled
[JENKINS] Archiving disabled
[JENKINS] Archiving disabled
Waiting for Jenkins to finish collecting data
mavenExecutionResult exceptions not empty
message : Failed to execute goal org.apache.maven.plugins:maven-compiler-plugin:2.5.1:compile
(default-compile) on project cloud-server: Compilation failure
<https://builds.apache.org/job/cloudstack-apidocs-master/ws/server/src/com/cloud/api/query/ViewResponseHelper.java>:[207,29]
cannot find symbol
symbol  : variable UserContext
location: class com.cloud.api.query.ViewResponseHelper

cause : Compilation failure
<https://builds.apache.org/job/cloudstack-apidocs-master/ws/server/src/com/cloud/api/query/ViewResponseHelper.java>:[207,29]
cannot find symbol
symbol  : variable UserContext
location: class com.cloud.api.query.ViewResponseHelper

Stack trace : 
org.apache.maven.lifecycle.LifecycleExecutionException: Failed to execute goal org.apache.maven.plugins:maven-compiler-plugin:2.5.1:compile
(default-compile) on project cloud-server: Compilation failure
<https://builds.apache.org/job/cloudstack-apidocs-master/ws/server/src/com/cloud/api/query/ViewResponseHelper.java>:[207,29]
cannot find symbol
symbol  : variable UserContext
location: class com.cloud.api.query.ViewResponseHelper

	at org.apache.maven.lifecycle.internal.MojoExecutor.execute(MojoExecutor.java:213)
	at org.apache.maven.lifecycle.internal.MojoExecutor.execute(MojoExecutor.java:153)
	at org.apache.maven.lifecycle.internal.MojoExecutor.execute(MojoExecutor.java:145)
	at org.apache.maven.lifecycle.internal.LifecycleModuleBuilder.buildProject(LifecycleModuleBuilder.java:84)
	at org.apache.maven.lifecycle.internal.LifecycleModuleBuilder.buildProject(LifecycleModuleBuilder.java:59)
	at org.apache.maven.lifecycle.internal.LifecycleStarter.singleThreadedBuild(LifecycleStarter.java:183)
	at org.apache.maven.lifecycle.internal.LifecycleStarter.execute(LifecycleStarter.java:161)
	at org.apache.maven.DefaultMaven.doExecute(DefaultMaven.java:320)
	at org.apache.maven.DefaultMaven.execute(DefaultMaven.java:156)
	at org.jvnet.hudson.maven3.launcher.Maven3Launcher.main(Maven3Launcher.java:117)
	at sun.reflect.NativeMethodAccessorImpl.invoke0(Native Method)
	at sun.reflect.NativeMethodAccessorImpl.invoke(NativeMethodAccessorImpl.java:39)
	at sun.reflect.DelegatingMethodAccessorImpl.invoke(DelegatingMethodAccessorImpl.java:25)
	at java.lang.reflect.Method.invoke(Method.java:597)
	at org.codehaus.plexus.classworlds.launcher.Launcher.launchStandard(Launcher.java:329)
	at org.codehaus.plexus.classworlds.launcher.Launcher.launch(Launcher.java:239)
	at org.jvnet.hudson.maven3.agent.Maven3Main.launch(Maven3Main.java:178)
	at sun.reflect.NativeMethodAccessorImpl.invoke0(Native Method)
	at sun.reflect.NativeMethodAccessorImpl.invoke(NativeMethodAccessorImpl.java:39)
	at sun.reflect.DelegatingMethodAccessorImpl.invoke(DelegatingMethodAccessorImpl.java:25)
	at java.lang.reflect.Method.invoke(Method.java:597)
	at hudson.maven.Maven3Builder.call(Maven3Builder.java:129)
	at hudson.maven.Maven3Builder.call(Maven3Builder.java:67)
	at hudson.remoting.UserRequest.perform(UserRequest.java:118)
	at hudson.remoting.UserRequest.perform(UserRequest.java:48)
	at hudson.remoting.Request$2.run(Request.java:326)
	at hudson.remoting.InterceptingExecutorService$1.call(InterceptingExecutorService.java:72)
	at java.util.concurrent.FutureTask$Sync.innerRun(FutureTask.java:303)
	at java.util.concurrent.FutureTask.run(FutureTask.java:138)
	at java.util.concurrent.ThreadPoolExecutor$Worker.runTask(ThreadPoolExecutor.java:895)
	at java.util.concurrent.ThreadPoolExecutor$Worker.run(ThreadPoolExecutor.java:918)
	at java.lang.Thread.run(Thread.java:662)
Caused by: org.apache.maven.plugin.CompilationFailureException: Compilation failure
<https://builds.apache.org/job/cloudstack-apidocs-master/ws/server/src/com/cloud/api/query/ViewResponseHelper.java>:[207,29]
cannot find symbol
symbol  : variable UserContext
location: class com.cloud.api.query.ViewResponseHelper

	at org.apache.maven.plugin.AbstractCompilerMojo.execute(AbstractCompilerMojo.java:729)
	at org.apache.maven.plugin.CompilerMojo.execute(CompilerMojo.java:128)
	at org.apache.maven.plugin.DefaultBuildPluginManager.executeMojo(DefaultBuildPluginManager.java:101)
	at org.apache.maven.lifecycle.internal.MojoExecutor.execute(MojoExecutor.java:209)
	... 31 more
channel stopped
[cloudstack-apidocs-master] $ /bin/bash -xe /tmp/hudson7262312615737426309.sh
+ mvn -P developer -pl :cloud-apidoc
[INFO] Scanning for projects...
[INFO]                                                                         
[INFO] ------------------------------------------------------------------------
[INFO] Building Apache CloudStack apidocs 4.2.0-SNAPSHOT
[INFO] ------------------------------------------------------------------------
[INFO] 
[INFO] --- maven-remote-resources-plugin:1.3:process (default) @ cloud-apidoc ---
[INFO] 
[INFO] --- exec-maven-plugin:1.2.1:exec (compile) @ cloud-apidoc ---
Check, is this api part of another build profile? Null value for key: addVmwareDc preProcessedCommand=1
Check, is this api part of another build profile? Null value for key: removeVmwareDc preProcessedCommand=1
Check, is this api part of another build profile? Null value for key: listVmwareDcs preProcessedCommand=1
Check, is this api part of another build profile? Null value for key: deleteCiscoNexusVSM
preProcessedCommand=1
Check, is this api part of another build profile? Null value for key: enableCiscoNexusVSM
preProcessedCommand=1
Check, is this api part of another build profile? Null value for key: disableCiscoNexusVSM
preProcessedCommand=1
Check, is this api part of another build profile? Null value for key: listCiscoNexusVSMs preProcessedCommand=1
Check, is this api part of another build profile? Null value for key: addExternalLoadBalancer
preProcessedCommand=1
Check, is this api part of another build profile? Null value for key: deleteExternalLoadBalancer
preProcessedCommand=1
Check, is this api part of another build profile? Null value for key: listExternalLoadBalancers
preProcessedCommand=1
Check, is this api part of another build profile? Null value for key: addF5LoadBalancer preProcessedCommand=1
Check, is this api part of another build profile? Null value for key: configureF5LoadBalancer
preProcessedCommand=1
Check, is this api part of another build profile? Null value for key: deleteF5LoadBalancer
preProcessedCommand=1
Check, is this api part of another build profile? Null value for key: listF5LoadBalancers
preProcessedCommand=1
Check, is this api part of another build profile? Null value for key: listF5LoadBalancerNetworks
preProcessedCommand=1
Check, is this api part of another build profile? Null value for key: addExternalFirewall
preProcessedCommand=1
Check, is this api part of another build profile? Null value for key: deleteExternalFirewall
preProcessedCommand=1
Check, is this api part of another build profile? Null value for key: listExternalFirewalls
preProcessedCommand=1
Check, is this api part of another build profile? Null value for key: addSrxFirewall preProcessedCommand=1
Check, is this api part of another build profile? Null value for key: deleteSrxFirewall preProcessedCommand=1
Check, is this api part of another build profile? Null value for key: configureSrxFirewall
preProcessedCommand=1
Check, is this api part of another build profile? Null value for key: listSrxFirewalls preProcessedCommand=1
Check, is this api part of another build profile? Null value for key: listSrxFirewallNetworks
preProcessedCommand=1
Check, is this api part of another build profile? Null value for key: createVolumeOnFiler
preProcessedCommand=15
Check, is this api part of another build profile? Null value for key: destroyVolumeOnFiler
preProcessedCommand=15
Check, is this api part of another build profile? Null value for key: listVolumesOnFiler preProcessedCommand=15
Check, is this api part of another build profile? Null value for key: createLunOnFiler preProcessedCommand=15
Check, is this api part of another build profile? Null value for key: destroyLunOnFiler preProcessedCommand=15
Check, is this api part of another build profile? Null value for key: listLunsOnFiler preProcessedCommand=15
Check, is this api part of another build profile? Null value for key: associateLun preProcessedCommand=15
Check, is this api part of another build profile? Null value for key: dissociateLun preProcessedCommand=15
Check, is this api part of another build profile? Null value for key: createPool preProcessedCommand=15
Check, is this api part of another build profile? Null value for key: deletePool preProcessedCommand=15
Check, is this api part of another build profile? Null value for key: modifyPool preProcessedCommand=15
Check, is this api part of another build profile? Null value for key: listPools preProcessedCommand=15
Check, is this api part of another build profile? Null value for key: addNetscalerLoadBalancer
preProcessedCommand=1
Check, is this api part of another build profile? Null value for key: deleteNetscalerLoadBalancer
preProcessedCommand=1
Check, is this api part of another build profile? Null value for key: configureNetscalerLoadBalancer
preProcessedCommand=1
Check, is this api part of another build profile? Null value for key: listNetscalerLoadBalancers
preProcessedCommand=1
Check, is this api part of another build profile? Null value for key: listNetscalerLoadBalancerNetworks
preProcessedCommand=1
Check, is this api part of another build profile? Null value for key: configureSimulator preProcessedCommand=1
Check, is this api part of another build profile? Null value for key: addCiscoVnmcResource
preProcessedCommand=1
Check, is this api part of another build profile? Null value for key: deleteCiscoVnmcResource
preProcessedCommand=1
Check, is this api part of another build profile? Null value for key: listCiscoVnmcResources
preProcessedCommand=1
Check, is this api part of another build profile? Null value for key: addCiscoAsa1000vResource
preProcessedCommand=1
Check, is this api part of another build profile? Null value for key: deleteCiscoAsa1000vResource
preProcessedCommand=1
Check, is this api part of another build profile? Null value for key: listCiscoAsa1000vResources
preProcessedCommand=1
Traceback (most recent call last):
  File "/x1/jenkins/jenkins-slave/workspace/cloudstack-apidocs-master/tools/apidoc/gen_toc.py",
line 190, in <module>
    category = choose_category(fn)
  File "/x1/jenkins/jenkins-slave/workspace/cloudstack-apidocs-master/tools/apidoc/gen_toc.py",
line 170, in choose_category
    (fn, __file__))
Exception: Need to add a category for listCacheStores.xml to /x1/jenkins/jenkins-slave/workspace/cloudstack-apidocs-master/tools/apidoc/gen_toc.py:known_categories
[INFO] ------------------------------------------------------------------------
[INFO] BUILD FAILURE
[INFO] ------------------------------------------------------------------------
[INFO] Total time: 13.912s
[INFO] Finished at: Tue Jul 30 18:48:44 UTC 2013
[INFO] Final Memory: 20M/181M
[INFO] ------------------------------------------------------------------------
[ERROR] Failed to execute goal org.codehaus.mojo:exec-maven-plugin:1.2.1:exec (compile) on
project cloud-apidoc: Command execution failed. Process exited with an error: 1 (Exit value:
1) -> [Help 1]
[ERROR] 
[ERROR] To see the full stack trace of the errors, re-run Maven with the -e switch.
[ERROR] Re-run Maven using the -X switch to enable full debug logging.
[ERROR] 
[ERROR] For more information about the errors and possible solutions, please read the following
articles:
[ERROR] [Help 1] http://cwiki.apache.org/confluence/display/MAVEN/MojoExecutionException
Build step 'Execute shell' marked build as failure
Archiving artifacts

Mime
View raw message