cloudstack-commits mailing list archives

Site index · List index
Message view « Date » · « Thread »
Top « Date » · « Thread »
From Apache Jenkins Server <jenk...@builds.apache.org>
Subject Build failed in Jenkins: cloudstack-apidocs-41 #579
Date Thu, 18 Jul 2013 21:48:03 GMT
See <https://builds.apache.org/job/cloudstack-apidocs-41/579/>

------------------------------------------
[...truncated 3071 lines...]

[INFO] --- maven-install-plugin:2.3.1:install (default-install) @ cloud-testclient ---
[INFO] Installing <https://builds.apache.org/job/cloudstack-apidocs-41/ws/test/pom.xml>
to /home/jenkins/jenkins-slave/maven-repositories/0/org/apache/cloudstack/cloud-testclient/4.1.1-SNAPSHOT/cloud-testclient-4.1.1-SNAPSHOT.pom
[INFO] Installing <https://builds.apache.org/job/cloudstack-apidocs-41/ws/test/target/cloud-testclient-4.1.1-SNAPSHOT-tests.jar>
to /home/jenkins/jenkins-slave/maven-repositories/0/org/apache/cloudstack/cloud-testclient/4.1.1-SNAPSHOT/cloud-testclient-4.1.1-SNAPSHOT-tests.jar
[INFO]                                                                         
[INFO] ------------------------------------------------------------------------
[INFO] Building Apache CloudStack Engine Storage integration test Component 4.1.1-SNAPSHOT
[INFO] ------------------------------------------------------------------------
[INFO] Deleting <https://builds.apache.org/job/cloudstack-apidocs-41/ws/engine/storage/integration-test/target>
[INFO] 
[INFO] --- maven-clean-plugin:2.5:clean (default-clean) @ cloud-engine-storage-integration-test
---
[INFO] 
[INFO] --- maven-remote-resources-plugin:1.3:process (default) @ cloud-engine-storage-integration-test
---
[INFO] [debug] execute contextualize
[INFO] Using 'UTF-8' encoding to copy filtered resources.
[INFO] skip non existing resourceDirectory <https://builds.apache.org/job/cloudstack-apidocs-41/ws/engine/storage/integration-test/src/main/resources>

[INFO] --- maven-resources-plugin:2.5:resources (default-resources) @ cloud-engine-storage-integration-test
---
[INFO] Copying 3 resources
[INFO] No sources to compile
[INFO] 
[INFO] --- maven-compiler-plugin:2.5.1:compile (default-compile) @ cloud-engine-storage-integration-test
---
[INFO] [debug] execute contextualize
[INFO] Using 'UTF-8' encoding to copy filtered resources.
[INFO] Copying 2 resources

[INFO] --- maven-resources-plugin:2.5:testResources (default-testResources) @ cloud-engine-storage-integration-test
---
[INFO] Copying 3 resources
[INFO] [INFO] Compiling 18 source files to <https://builds.apache.org/job/cloudstack-apidocs-41/ws/engine/storage/integration-test/target/test-classes>

[INFO] --- maven-compiler-plugin:2.5.1:testCompile (default-testCompile) @ cloud-engine-storage-integration-test
---
[INFO] [INFO] Nothing to compile - all classes are up to date

[INFO] --- maven-compiler-plugin:2.5.1:testCompile (default) @ cloud-engine-storage-integration-test
---
[INFO] [INFO] Tests are skipped.

[INFO] --- maven-surefire-plugin:2.12:test (default-test) @ cloud-engine-storage-integration-test
---
[INFO] [INFO] Building jar: <https://builds.apache.org/job/cloudstack-apidocs-41/ws/engine/storage/integration-test/target/cloud-engine-storage-integration-test-4.1.1-SNAPSHOT.jar>

[INFO] --- maven-jar-plugin:2.4:jar (default-jar) @ cloud-engine-storage-integration-test
---
[INFO] 
[INFO] --- maven-site-plugin:3.1:attach-descriptor (attach-descriptor) @ cloud-engine-storage-integration-test
---
[INFO] [INFO] Tests are skipped.

[INFO] --- maven-surefire-plugin:2.12:test (default) @ cloud-engine-storage-integration-test
---
[INFO] [INFO] Installing <https://builds.apache.org/job/cloudstack-apidocs-41/ws/engine/storage/integration-test/target/cloud-engine-storage-integration-test-4.1.1-SNAPSHOT.jar>
to /home/jenkins/jenkins-slave/maven-repositories/0/org/apache/cloudstack/cloud-engine-storage-integration-test/4.1.1-SNAPSHOT/cloud-engine-storage-integration-test-4.1.1-SNAPSHOT.jar

[INFO] --- maven-install-plugin:2.3.1:install (default-install) @ cloud-engine-storage-integration-test
---
[INFO] Installing <https://builds.apache.org/job/cloudstack-apidocs-41/ws/engine/storage/integration-test/pom.xml>
to /home/jenkins/jenkins-slave/maven-repositories/0/org/apache/cloudstack/cloud-engine-storage-integration-test/4.1.1-SNAPSHOT/cloud-engine-storage-integration-test-4.1.1-SNAPSHOT.pom
[INFO]                                                                         
[INFO] ------------------------------------------------------------------------
[INFO] Building Apache CloudStack Cloud Engine Service 4.1.1-SNAPSHOT
[INFO] ------------------------------------------------------------------------
[INFO] Deleting <https://builds.apache.org/job/cloudstack-apidocs-41/ws/engine/service/target>
[INFO] 
[INFO] --- maven-clean-plugin:2.5:clean (default-clean) @ cloud-engine-service ---
[INFO] 
[INFO] --- maven-remote-resources-plugin:1.3:process (default) @ cloud-engine-service ---
[INFO] [debug] execute contextualize
[INFO] Using 'UTF-8' encoding to copy filtered resources.
[INFO] skip non existing resourceDirectory <https://builds.apache.org/job/cloudstack-apidocs-41/ws/engine/service/src/main/resources>
[INFO] Copying 3 resources

[INFO] --- maven-resources-plugin:2.5:resources (default-resources) @ cloud-engine-service
---
[INFO] 
[INFO] --- maven-compiler-plugin:2.5.1:compile (default-compile) @ cloud-engine-service ---
[INFO] Nothing to compile - all classes are up to date
[debug] execute contextualize
[INFO] [INFO] Using 'UTF-8' encoding to copy filtered resources.
[INFO] skip non existing resourceDirectory <https://builds.apache.org/job/cloudstack-apidocs-41/ws/engine/service/src/test/resources>
[INFO] Copying 3 resources

[INFO] --- maven-resources-plugin:2.5:testResources (default-testResources) @ cloud-engine-service
---
[INFO] [INFO] No sources to compile

[INFO] --- maven-compiler-plugin:2.5.1:testCompile (default-testCompile) @ cloud-engine-service
---
[INFO] [INFO] Surefire report directory: <https://builds.apache.org/job/cloudstack-apidocs-41/ws/engine/service/target/surefire-reports>

[INFO] --- maven-surefire-plugin:2.12:test (default-test) @ cloud-engine-service ---

-------------------------------------------------------
 T E S T S
-------------------------------------------------------

Results :

Tests run: 0, Failures: 0, Errors: 0, Skipped: 0

[JENKINS] Recording test results
[INFO] 
[INFO] --- maven-war-plugin:2.1.1:war (default-war) @ cloud-engine-service ---
[INFO] Packaging webapp
[INFO] Assembling webapp [cloud-engine-service] in [<https://builds.apache.org/job/cloudstack-apidocs-41/ws/engine/service/target/engine]>
[INFO] Processing war project
[INFO] Copying webapp resources [<https://builds.apache.org/job/cloudstack-apidocs-41/ws/engine/service/src/main/webapp]>
[INFO] Webapp assembled in [267 msecs]
[INFO] Building war: <https://builds.apache.org/job/cloudstack-apidocs-41/ws/engine/service/target/engine.war>
[INFO] WEB-INF/web.xml already added, skipping
[INFO] 
[INFO] --- maven-site-plugin:3.1:attach-descriptor (attach-descriptor) @ cloud-engine-service
---
[INFO] [INFO] Installing <https://builds.apache.org/job/cloudstack-apidocs-41/ws/engine/service/target/engine.war>
to /home/jenkins/jenkins-slave/maven-repositories/0/org/apache/cloudstack/cloud-engine-service/4.1.1-SNAPSHOT/cloud-engine-service-4.1.1-SNAPSHOT.war

[INFO] --- maven-install-plugin:2.3.1:install (default-install) @ cloud-engine-service ---
[INFO] Installing <https://builds.apache.org/job/cloudstack-apidocs-41/ws/engine/service/pom.xml>
to /home/jenkins/jenkins-slave/maven-repositories/0/org/apache/cloudstack/cloud-engine-service/4.1.1-SNAPSHOT/cloud-engine-service-4.1.1-SNAPSHOT.pom
[INFO] ------------------------------------------------------------------------
[INFO] Reactor Summary:
[INFO] 
[INFO] Apache CloudStack ................................. SUCCESS [25.372s]
[INFO] Apache CloudStack Utils ........................... SUCCESS [45.753s]
[INFO] Apache CloudStack API ............................. SUCCESS [11.718s]
[INFO] Apache CloudStack Core ............................ SUCCESS [5.613s]
[INFO] Apache CloudStack Agents .......................... SUCCESS [10.482s]
[INFO] Apache CloudStack SystemVM Patches ................ SUCCESS [4.129s]
[INFO] Apache CloudStack Console Proxy ................... SUCCESS [8.604s]
[INFO] Apache CloudStack Framework ....................... SUCCESS [2.265s]
[INFO] Apache CloudStack Framework - IPC ................. SUCCESS [4.053s]
[INFO] Apache CloudStack Framework - REST ................ SUCCESS [4.898s]
[INFO] Apache CloudStack Cloud Engine .................... SUCCESS [0.879s]
[INFO] Apache CloudStack Cloud Engine API ................ SUCCESS [3.823s]
[INFO] Apache CloudStack Framework - Event Notification .. SUCCESS [3.505s]
[INFO] Apache CloudStack Server .......................... SUCCESS [17.558s]
[INFO] Apache CloudStack Usage Server .................... SUCCESS [4.923s]
[INFO] Apache XenSource XAPI ............................. SUCCESS [3.914s]
[INFO] Apache CloudStack Plugin POM ...................... SUCCESS [0.721s]
[INFO] Apache CloudStack Plugin - API Rate Limit ......... SUCCESS [5.888s]
[INFO] Apache CloudStack Plugin - API Discovery .......... SUCCESS [4.294s]
[INFO] Apache CloudStack Plugin - ACL Static Role Based .. SUCCESS [3.073s]
[INFO] Apache CloudStack Plugin - User Concentrated Pod Deployment Planner  SUCCESS [2.822s]
[INFO] Apache CloudStack Plugin - User Dispersing Deployment Planner  SUCCESS [2.991s]
[INFO] Apache CloudStack Plugin - Host Allocator Random .. SUCCESS [3.192s]
[INFO] Apache CloudStack Plugin - Hypervisor OracleVM .... SUCCESS [3.832s]
[INFO] Apache CloudStack Cloud Engine Internal Components API  SUCCESS [2.989s]
[INFO] Apache CloudStack Engine Storage Component ........ SUCCESS [4.429s]
[INFO] Apache CloudStack Plugin - Open vSwitch ........... SUCCESS [3.197s]
[INFO] Apache CloudStack Plugin - Hypervisor Xen ......... SUCCESS [4.710s]
[INFO] Apache CloudStack Plugin - Hypervisor KVM ......... SUCCESS [5.796s]
[INFO] Apache CloudStack Plugin - RabbitMQ Event Bus ..... SUCCESS [6.040s]
[INFO] Apache CloudStack Plugin - Hypervisor Simulator ... SUCCESS [3.913s]
[INFO] Apache CloudStack Plugin - Network Elastic Load Balancer  SUCCESS [3.080s]
[INFO] Apache CloudStack Plugin - Network Nicira NVP ..... SUCCESS [6.512s]
[INFO] Apache CloudStack Plugin - BigSwitch Virtual Network Segment  SUCCESS [7.287s]
[INFO] Apache CloudStack Plugin - Storage Allocator Random  SUCCESS [5.522s]
[INFO] Apache CloudStack Plugin - User Authenticator LDAP  SUCCESS [4.920s]
[INFO] Apache CloudStack Plugin - User Authenticator MD5 . SUCCESS [4.623s]
[INFO] Apache CloudStack Plugin - User Authenticator Plain Text  SUCCESS [3.944s]
[INFO] Apache CloudStack Plugin - User Authenticator SHA256 Salted  SUCCESS [4.542s]
[INFO] Apache CloudStack Plugin - Dns Notifier Example ... SUCCESS [2.804s]
[INFO] Apache CloudStack Engine Storage Image Component .. SUCCESS [3.058s]
[INFO] Apache CloudStack Plugin - Storage Image S3 ....... SUCCESS [2.570s]
[INFO] Apache CloudStack Engine Storage Volume Component . SUCCESS [6.349s]
[INFO] Apache CloudStack Plugin - Storage Volume solidfire  SUCCESS [4.995s]
[INFO] Apache CloudStack Cloud Engine Compute Component .. SUCCESS [2.861s]
[INFO] Apache CloudStack Cloud Engine API ................ SUCCESS [2.758s]
[INFO] Apache CloudStack Cloud Engine Orchestration Component  SUCCESS [5.828s]
[INFO] Apache CloudStack Cloud Engine Schema Component ... SUCCESS [2.307s]
[INFO] Apache CloudStack Engine Storage Backup Component . SUCCESS [3.066s]
[INFO] Apache CloudStack Engine Storage Image Motion Component  SUCCESS [4.914s]
[INFO] Apache CloudStack Engine Storage Snapshot Component  SUCCESS [5.952s]
[INFO] Apache CloudStack Client UI ....................... SUCCESS [14.861s]
[INFO] Apache CloudStack Test ............................ SUCCESS [7.922s]
[INFO] Apache CloudStack Engine Storage integration test Component  SUCCESS [7.830s]
[INFO] Apache CloudStack Cloud Engine Service ............ SUCCESS [8.318s]
[INFO] ------------------------------------------------------------------------
[INFO] BUILD SUCCESS
[INFO] ------------------------------------------------------------------------
[INFO] Total time: 5:54.258s
[INFO] Finished at: Thu Jul 18 21:47:39 UTC 2013
[INFO] Final Memory: 35M/153M
[INFO] ------------------------------------------------------------------------
[JENKINS] Archiving disabled
[JENKINS] Archiving disabled
[JENKINS] Archiving disabled
[JENKINS] Archiving disabled
[JENKINS] Archiving disabled
[JENKINS] Archiving disabled
[JENKINS] Archiving disabled
[JENKINS] Archiving disabled
[JENKINS] Archiving disabled
[JENKINS] Archiving disabled
[JENKINS] Archiving disabled
[JENKINS] Archiving disabled
[JENKINS] Archiving disabled
[JENKINS] Archiving disabled
[JENKINS] Archiving disabled
[JENKINS] Archiving disabled
[JENKINS] Archiving disabled
[JENKINS] Archiving disabled
[JENKINS] Archiving disabled
[JENKINS] Archiving disabled
[JENKINS] Archiving disabled
[JENKINS] Archiving disabled
[JENKINS] Archiving disabled
[JENKINS] Archiving disabled
[JENKINS] Archiving disabled
[JENKINS] Archiving disabled
[JENKINS] Archiving disabled
[JENKINS] Archiving disabled
[JENKINS] Archiving disabled
[JENKINS] Archiving disabled
[JENKINS] Archiving disabled
[JENKINS] Archiving disabled
[JENKINS] Archiving disabled
[JENKINS] Archiving disabled
[JENKINS] Archiving disabled
[JENKINS] Archiving disabled
[JENKINS] Archiving disabled
[JENKINS] Archiving disabled
[JENKINS] Archiving disabled
[JENKINS] Archiving disabled
[JENKINS] Archiving disabled
[JENKINS] Archiving disabled
[JENKINS] Archiving disabled
[JENKINS] Archiving disabled
[JENKINS] Archiving disabled
[JENKINS] Archiving disabled
[JENKINS] Archiving disabled
[JENKINS] Archiving disabled
[JENKINS] Archiving disabled
[JENKINS] Archiving disabled
[JENKINS] Archiving disabled
[JENKINS] Archiving disabled
[JENKINS] Archiving disabled
[JENKINS] Archiving disabled
[JENKINS] Archiving disabled
Waiting for Jenkins to finish collecting data
channel stopped
[cloudstack-apidocs-41] $ /bin/bash -xe /tmp/hudson4206857781635030292.sh
+ mvn -P developer -pl :cloud-apidoc
[INFO] Scanning for projects...
[INFO]                                                                         
[INFO] ------------------------------------------------------------------------
[INFO] Building Apache CloudStack apidoc Tools 4.1.1-SNAPSHOT
[INFO] ------------------------------------------------------------------------
[INFO] ------------------------------------------------------------------------
[INFO] BUILD FAILURE
[INFO] ------------------------------------------------------------------------
[INFO] Total time: 1.643s
[INFO] Finished at: Thu Jul 18 21:48:01 UTC 2013
[INFO] Final Memory: 12M/109M
[INFO] ------------------------------------------------------------------------
[ERROR] Failed to execute goal on project cloud-apidoc: Could not resolve dependencies for
project org.apache.cloudstack:cloud-apidoc:pom:4.1.1-SNAPSHOT: Failure to find org.apache.cloudstack:cloud-client-ui:war:4.1.1-SNAPSHOT
in http://repository.apache.org/snapshots was cached in the local repository, resolution will
not be reattempted until the update interval of Nexus has elapsed or updates are forced ->
[Help 1]
[ERROR] 
[ERROR] To see the full stack trace of the errors, re-run Maven with the -e switch.
[ERROR] Re-run Maven using the -X switch to enable full debug logging.
[ERROR] 
[ERROR] For more information about the errors and possible solutions, please read the following
articles:
[ERROR] [Help 1] http://cwiki.apache.org/confluence/display/MAVEN/DependencyResolutionException
Build step 'Execute shell' marked build as failure
Archiving artifacts

Mime
View raw message