cloudstack-commits mailing list archives

Site index · List index
Message view « Date » · « Thread »
Top « Date » · « Thread »
From Apache Jenkins Server <jenk...@builds.apache.org>
Subject Build failed in Jenkins: cloudstack-apidocs-41 #642
Date Tue, 30 Jul 2013 10:03:02 GMT
See <https://builds.apache.org/job/cloudstack-apidocs-41/642/>

------------------------------------------
[...truncated 1114 lines...]
Jul 30, 2013 9:54:16 AM org.apache.maven.cli.event.ExecutionEventLogger projectStarted
INFO: ------------------------------------------------------------------------
Jul 30, 2013 9:54:16 AM org.apache.maven.cli.event.ExecutionEventLogger projectStarted
INFO: Building Apache CloudStack Framework - Event Notification 4.1.1-SNAPSHOT
Jul 30, 2013 9:54:16 AM org.apache.maven.cli.event.ExecutionEventLogger projectStarted
INFO: ------------------------------------------------------------------------
Jul 30, 2013 9:54:16 AM org.apache.maven.cli.event.ExecutionEventLogger mojoStarted
INFO: 
Jul 30, 2013 9:54:16 AM org.apache.maven.cli.event.ExecutionEventLogger mojoStarted
INFO: --- maven-clean-plugin:2.5:clean (default-clean) @ cloud-framework-events ---
[INFO] Deleting <https://builds.apache.org/job/cloudstack-apidocs-41/ws/framework/events/target>
Jul 30, 2013 9:54:16 AM org.apache.maven.cli.event.ExecutionEventLogger mojoStarted
INFO: 
Jul 30, 2013 9:54:16 AM org.apache.maven.cli.event.ExecutionEventLogger mojoStarted
INFO: --- maven-remote-resources-plugin:1.3:process (default) @ cloud-framework-events ---
Jul 30, 2013 9:54:16 AM org.apache.maven.cli.event.ExecutionEventLogger mojoStarted
INFO: 
Jul 30, 2013 9:54:16 AM org.apache.maven.cli.event.ExecutionEventLogger mojoStarted
INFO: --- maven-resources-plugin:2.5:resources (default-resources) @ cloud-framework-events
---
[debug] execute contextualize
[INFO] Using 'UTF-8' encoding to copy filtered resources.
[INFO] skip non existing resourceDirectory <https://builds.apache.org/job/cloudstack-apidocs-41/ws/framework/events/src/main/resources>
[INFO] Copying 3 resources
Jul 30, 2013 9:54:16 AM org.apache.maven.cli.event.ExecutionEventLogger mojoStarted
INFO: 
Jul 30, 2013 9:54:16 AM org.apache.maven.cli.event.ExecutionEventLogger mojoStarted
INFO: --- maven-compiler-plugin:2.5.1:compile (default-compile) @ cloud-framework-events ---
[INFO] Compiling 5 source files to <https://builds.apache.org/job/cloudstack-apidocs-41/ws/framework/events/target/classes>
Jul 30, 2013 9:54:17 AM org.apache.maven.cli.event.ExecutionEventLogger mojoStarted
INFO: 
Jul 30, 2013 9:54:17 AM org.apache.maven.cli.event.ExecutionEventLogger mojoStarted
INFO: --- maven-resources-plugin:2.5:testResources (default-testResources) @ cloud-framework-events
---
[debug] execute contextualize
[INFO] Using 'UTF-8' encoding to copy filtered resources.
[INFO] skip non existing resourceDirectory <https://builds.apache.org/job/cloudstack-apidocs-41/ws/framework/events/src/test/resources>
[INFO] Copying 3 resources
Jul 30, 2013 9:54:17 AM org.apache.maven.cli.event.ExecutionEventLogger mojoStarted
INFO: 
Jul 30, 2013 9:54:17 AM org.apache.maven.cli.event.ExecutionEventLogger mojoStarted
INFO: --- maven-compiler-plugin:2.5.1:testCompile (default-testCompile) @ cloud-framework-events
---
[INFO] No sources to compile
Jul 30, 2013 9:54:17 AM org.apache.maven.cli.event.ExecutionEventLogger mojoStarted
INFO: 
Jul 30, 2013 9:54:17 AM org.apache.maven.cli.event.ExecutionEventLogger mojoStarted
INFO: --- maven-surefire-plugin:2.12:test (default-test) @ cloud-framework-events ---
[INFO] Surefire report directory: <https://builds.apache.org/job/cloudstack-apidocs-41/ws/framework/events/target/surefire-reports>

-------------------------------------------------------
 T E S T S
-------------------------------------------------------

Results :

Tests run: 0, Failures: 0, Errors: 0, Skipped: 0

[JENKINS] Recording test results
Jul 30, 2013 9:54:18 AM org.apache.maven.cli.event.ExecutionEventLogger mojoStarted
INFO: 
Jul 30, 2013 9:54:18 AM org.apache.maven.cli.event.ExecutionEventLogger mojoStarted
INFO: --- maven-jar-plugin:2.4:jar (default-jar) @ cloud-framework-events ---
[INFO] Building jar: <https://builds.apache.org/job/cloudstack-apidocs-41/ws/framework/events/target/cloud-framework-events-4.1.1-SNAPSHOT.jar>
Jul 30, 2013 9:54:18 AM org.apache.maven.cli.event.ExecutionEventLogger mojoStarted
INFO: 
Jul 30, 2013 9:54:18 AM org.apache.maven.cli.event.ExecutionEventLogger mojoStarted
INFO: --- maven-site-plugin:3.1:attach-descriptor (attach-descriptor) @ cloud-framework-events
---
Jul 30, 2013 9:54:18 AM org.apache.maven.cli.event.ExecutionEventLogger mojoStarted
INFO: 
Jul 30, 2013 9:54:18 AM org.apache.maven.cli.event.ExecutionEventLogger mojoStarted
INFO: --- maven-install-plugin:2.3.1:install (default-install) @ cloud-framework-events ---
[INFO] Installing <https://builds.apache.org/job/cloudstack-apidocs-41/ws/framework/events/target/cloud-framework-events-4.1.1-SNAPSHOT.jar>
to /home/jenkins/jenkins-slave/maven-repositories/1/org/apache/cloudstack/cloud-framework-events/4.1.1-SNAPSHOT/cloud-framework-events-4.1.1-SNAPSHOT.jar
[INFO] Installing <https://builds.apache.org/job/cloudstack-apidocs-41/ws/framework/events/pom.xml>
to /home/jenkins/jenkins-slave/maven-repositories/1/org/apache/cloudstack/cloud-framework-events/4.1.1-SNAPSHOT/cloud-framework-events-4.1.1-SNAPSHOT.pom
Jul 30, 2013 9:54:19 AM org.apache.maven.cli.event.ExecutionEventLogger projectStarted
INFO:                                                                         
Jul 30, 2013 9:54:19 AM org.apache.maven.cli.event.ExecutionEventLogger projectStarted
INFO: ------------------------------------------------------------------------
Jul 30, 2013 9:54:19 AM org.apache.maven.cli.event.ExecutionEventLogger projectStarted
INFO: Building Apache CloudStack Server 4.1.1-SNAPSHOT
Jul 30, 2013 9:54:19 AM org.apache.maven.cli.event.ExecutionEventLogger projectStarted
INFO: ------------------------------------------------------------------------
Jul 30, 2013 9:54:19 AM org.apache.maven.cli.event.ExecutionEventLogger mojoStarted
INFO: 
Jul 30, 2013 9:54:19 AM org.apache.maven.cli.event.ExecutionEventLogger mojoStarted
INFO: --- maven-clean-plugin:2.5:clean (default-clean) @ cloud-server ---
[INFO] Deleting <https://builds.apache.org/job/cloudstack-apidocs-41/ws/server/target>
Jul 30, 2013 9:54:22 AM org.apache.maven.cli.event.ExecutionEventLogger mojoStarted
INFO: 
Jul 30, 2013 9:54:22 AM org.apache.maven.cli.event.ExecutionEventLogger mojoStarted
INFO: --- maven-remote-resources-plugin:1.3:process (default) @ cloud-server ---
Jul 30, 2013 9:54:22 AM org.apache.maven.cli.event.ExecutionEventLogger mojoStarted
INFO: 
Jul 30, 2013 9:54:22 AM org.apache.maven.cli.event.ExecutionEventLogger mojoStarted
INFO: --- maven-antrun-plugin:1.7:run (generate-resource) @ cloud-server ---
[INFO] Executing tasks

main:
     [copy] Copying 3 files to <https://builds.apache.org/job/cloudstack-apidocs-41/ws/server/target/conf>
     [copy] Copying 1 file to <https://builds.apache.org/job/cloudstack-apidocs-41/ws/server/target/conf>
[INFO] Executed tasks
Jul 30, 2013 9:54:23 AM org.apache.maven.cli.event.ExecutionEventLogger mojoStarted
INFO: 
Jul 30, 2013 9:54:23 AM org.apache.maven.cli.event.ExecutionEventLogger mojoStarted
INFO: --- maven-resources-plugin:2.5:resources (default-resources) @ cloud-server ---
[debug] execute contextualize
[INFO] Using 'UTF-8' encoding to copy filtered resources.
[INFO] Copying 1 resource
[INFO] Copying 3 resources
Jul 30, 2013 9:54:23 AM org.apache.maven.cli.event.ExecutionEventLogger mojoStarted
INFO: 
Jul 30, 2013 9:54:23 AM org.apache.maven.cli.event.ExecutionEventLogger mojoStarted
INFO: --- maven-compiler-plugin:2.5.1:compile (default-compile) @ cloud-server ---
[INFO] Compiling 852 source files to <https://builds.apache.org/job/cloudstack-apidocs-41/ws/server/target/classes>
Jul 30, 2013 9:54:36 AM org.apache.maven.cli.event.ExecutionEventLogger mojoStarted
INFO: 
Jul 30, 2013 9:54:36 AM org.apache.maven.cli.event.ExecutionEventLogger mojoStarted
INFO: --- maven-resources-plugin:2.5:testResources (default-testResources) @ cloud-server
---
[debug] execute contextualize
[INFO] Using 'UTF-8' encoding to copy filtered resources.
[INFO] Copying 10 resources
[INFO] Copying 3 resources
Jul 30, 2013 9:54:36 AM org.apache.maven.cli.event.ExecutionEventLogger mojoStarted
INFO: 
Jul 30, 2013 9:54:36 AM org.apache.maven.cli.event.ExecutionEventLogger mojoStarted
INFO: --- maven-compiler-plugin:2.5.1:testCompile (default-testCompile) @ cloud-server ---
[INFO] Compiling 52 source files to <https://builds.apache.org/job/cloudstack-apidocs-41/ws/server/target/test-classes>
Jul 30, 2013 9:54:37 AM org.apache.maven.cli.event.ExecutionEventLogger mojoStarted
INFO: 
Jul 30, 2013 9:54:37 AM org.apache.maven.cli.event.ExecutionEventLogger mojoStarted
INFO: --- maven-surefire-plugin:2.12:test (default-test) @ cloud-server ---
[INFO] Surefire report directory: <https://builds.apache.org/job/cloudstack-apidocs-41/ws/server/target/surefire-reports>

-------------------------------------------------------
 T E S T S
-------------------------------------------------------
Running org.apache.cloudstack.region.RegionManagerTest
Tests run: 1, Failures: 0, Errors: 0, Skipped: 0, Time elapsed: 0.266 sec
Running com.cloud.keystore.KeystoreTest
org.apache.cloudstack.api.response.UserVmResponse/null/{"id":"3","securitygroup":[],"nic":[],"tags":[]}
org.apache.cloudstack.api.response.AlertResponse/null/{"id":"100","description":"Hello"}
Tests run: 1, Failures: 0, Errors: 0, Skipped: 0, Time elapsed: 0.116 sec
Running com.cloud.network.NetworkModelTest
Tests run: 1, Failures: 0, Errors: 0, Skipped: 0, Time elapsed: 0.147 sec
Running com.cloud.network.security.SecurityGroupQueueTest
Num Vms= 50 Queue size = 50
Num Vms= 20000 Queue size = 20000 time=522 ms
Num Vms= 5000 Queue size = 5000 time=743 ms
Num Vms= 1 Queue size = 1 time=1 ms
Num Vms= 1000000 Queue size = 1000000 time=499 ms
Num Vms= 1 Queue size = 1 time=209 ms
Total jobs dequeued = 10, num queued=1004 queue current size=994
Total jobs dequeued = 10, num queued=1008 queue current size=998
Total jobs dequeued = 1, num queued=1001 queue current size=1000
Total jobs dequeued = 10, num queued=1000 queue current size=990
Total jobs dequeued = 10, num queued=10 queue current size=0
Tests run: 4, Failures: 0, Errors: 0, Skipped: 0, Time elapsed: 2.004 sec
Running com.cloud.network.NetworkManagerTest
Tests run: 1, Failures: 0, Errors: 0, Skipped: 1, Time elapsed: 0 sec
Running com.cloud.network.firewall.FirewallManagerTest
Tests run: 1, Failures: 0, Errors: 0, Skipped: 1, Time elapsed: 0 sec
Running com.cloud.network.dao.NetworkDaoTest
Tests run: 2, Failures: 0, Errors: 0, Skipped: 0, Time elapsed: 0 sec

Results :

Tests run: 11, Failures: 0, Errors: 0, Skipped: 2

[JENKINS] Recording test results
Jul 30, 2013 9:54:44 AM org.apache.maven.cli.event.ExecutionEventLogger mojoStarted
INFO: 
Jul 30, 2013 9:54:44 AM org.apache.maven.cli.event.ExecutionEventLogger mojoStarted
INFO: --- maven-jar-plugin:2.4:jar (default-jar) @ cloud-server ---
[INFO] Building jar: <https://builds.apache.org/job/cloudstack-apidocs-41/ws/server/target/cloud-server-4.1.1-SNAPSHOT.jar>
Jul 30, 2013 9:54:45 AM org.apache.maven.cli.event.ExecutionEventLogger mojoStarted
INFO: 
Jul 30, 2013 9:54:45 AM org.apache.maven.cli.event.ExecutionEventLogger mojoStarted
INFO: --- maven-site-plugin:3.1:attach-descriptor (attach-descriptor) @ cloud-server ---
Jul 30, 2013 9:54:45 AM org.apache.maven.cli.event.ExecutionEventLogger mojoStarted
INFO: 
Jul 30, 2013 9:54:45 AM org.apache.maven.cli.event.ExecutionEventLogger mojoStarted
INFO: --- maven-install-plugin:2.3.1:install (default-install) @ cloud-server ---
[INFO] Installing <https://builds.apache.org/job/cloudstack-apidocs-41/ws/server/target/cloud-server-4.1.1-SNAPSHOT.jar>
to /home/jenkins/jenkins-slave/maven-repositories/1/org/apache/cloudstack/cloud-server/4.1.1-SNAPSHOT/cloud-server-4.1.1-SNAPSHOT.jar
[INFO] Installing <https://builds.apache.org/job/cloudstack-apidocs-41/ws/server/pom.xml>
to /home/jenkins/jenkins-slave/maven-repositories/1/org/apache/cloudstack/cloud-server/4.1.1-SNAPSHOT/cloud-server-4.1.1-SNAPSHOT.pom
Jul 30, 2013 9:54:46 AM org.apache.maven.cli.event.ExecutionEventLogger projectStarted
INFO:                                                                         
Jul 30, 2013 9:54:46 AM org.apache.maven.cli.event.ExecutionEventLogger projectStarted
INFO: ------------------------------------------------------------------------
Jul 30, 2013 9:54:46 AM org.apache.maven.cli.event.ExecutionEventLogger projectStarted
INFO: Building Apache CloudStack Usage Server 4.1.1-SNAPSHOT
Jul 30, 2013 9:54:46 AM org.apache.maven.cli.event.ExecutionEventLogger projectStarted
INFO: ------------------------------------------------------------------------
Jul 30, 2013 9:54:46 AM org.apache.maven.cli.event.ExecutionEventLogger mojoStarted
INFO: 
Jul 30, 2013 9:54:46 AM org.apache.maven.cli.event.ExecutionEventLogger mojoStarted
INFO: --- maven-clean-plugin:2.5:clean (default-clean) @ cloud-usage ---
[INFO] Deleting <https://builds.apache.org/job/cloudstack-apidocs-41/ws/usage/target>
Jul 30, 2013 9:54:46 AM org.apache.maven.cli.event.ExecutionEventLogger mojoStarted
INFO: 
Jul 30, 2013 9:54:46 AM org.apache.maven.cli.event.ExecutionEventLogger mojoStarted
INFO: --- maven-remote-resources-plugin:1.3:process (default) @ cloud-usage ---
Jul 30, 2013 9:54:47 AM org.apache.maven.cli.event.ExecutionEventLogger mojoStarted
INFO: 
Jul 30, 2013 9:54:47 AM org.apache.maven.cli.event.ExecutionEventLogger mojoStarted
INFO: --- maven-antrun-plugin:1.7:run (generate-resource) @ cloud-usage ---
[INFO] Executing tasks

main:
     [copy] Copying 1 file to <https://builds.apache.org/job/cloudstack-apidocs-41/ws/usage/target/transformed>
     [copy] Copying 1 file to <https://builds.apache.org/job/cloudstack-apidocs-41/ws/usage/target/transformed>
[INFO] Executed tasks
Jul 30, 2013 9:54:47 AM org.apache.maven.cli.event.ExecutionEventLogger mojoStarted
INFO: 
Jul 30, 2013 9:54:47 AM org.apache.maven.cli.event.ExecutionEventLogger mojoStarted
INFO: --- maven-resources-plugin:2.5:resources (default-resources) @ cloud-usage ---
[debug] execute contextualize
[INFO] Using 'UTF-8' encoding to copy filtered resources.
[INFO] Copying 1 resource
[INFO] Copying 3 resources
Jul 30, 2013 9:54:47 AM org.apache.maven.cli.event.ExecutionEventLogger mojoStarted
INFO: 
Jul 30, 2013 9:54:47 AM org.apache.maven.cli.event.ExecutionEventLogger mojoStarted
INFO: --- maven-compiler-plugin:2.5.1:compile (default-compile) @ cloud-usage ---
[INFO] Compiling 16 source files to <https://builds.apache.org/job/cloudstack-apidocs-41/ws/usage/target/classes>
[cloudstack-apidocs-41] $ /bin/bash -xe /tmp/hudson1348842929937649537.sh
+ mvn -P developer -pl :cloud-apidoc
[INFO] Scanning for projects...
[INFO]                                                                         
[INFO] ------------------------------------------------------------------------
[INFO] Building Apache CloudStack apidoc Tools 4.1.1-SNAPSHOT
[INFO] ------------------------------------------------------------------------
Downloading: http://repository.apache.org/snapshots/org/apache/cloudstack/cloud-client-ui/4.1.1-SNAPSHOT/maven-metadata.xml

Downloading: http://repository.apache.org/snapshots/org/apache/cloudstack/cloud-client-ui/4.1.1-SNAPSHOT/cloud-client-ui-4.1.1-SNAPSHOT.war

[INFO] ------------------------------------------------------------------------
[INFO] BUILD FAILURE
[INFO] ------------------------------------------------------------------------
[INFO] Total time: 2.350s
[INFO] Finished at: Tue Jul 30 10:02:59 UTC 2013
[INFO] Final Memory: 12M/114M
[INFO] ------------------------------------------------------------------------
[ERROR] Failed to execute goal on project cloud-apidoc: Could not resolve dependencies for
project org.apache.cloudstack:cloud-apidoc:pom:4.1.1-SNAPSHOT: Could not find artifact org.apache.cloudstack:cloud-client-ui:war:4.1.1-SNAPSHOT
in Nexus (http://repository.apache.org/snapshots) -> [Help 1]
[ERROR] 
[ERROR] To see the full stack trace of the errors, re-run Maven with the -e switch.
[ERROR] Re-run Maven using the -X switch to enable full debug logging.
[ERROR] 
[ERROR] For more information about the errors and possible solutions, please read the following
articles:
[ERROR] [Help 1] http://cwiki.apache.org/confluence/display/MAVEN/DependencyResolutionException
Build step 'Execute shell' marked build as failure
ERROR: Maven JVM terminated unexpectedly with exit code 143
Archiving artifacts

Mime
View raw message