cloudstack-commits mailing list archives

Site index · List index
Message view « Date » · « Thread »
Top « Date » · « Thread »
From Apache Jenkins Server <jenk...@builds.apache.org>
Subject Build failed in Jenkins: cloudstack-marvin-41 #559
Date Wed, 10 Jul 2013 12:46:22 GMT
See <https://builds.apache.org/job/cloudstack-marvin-41/559/changes>

Changes:

[muralimmreddy] CLOUDSTACK-3440: action events are not published due to conflict of

------------------------------------------
[...truncated 1252 lines...]
[INFO] Installing <https://builds.apache.org/job/cloudstack-marvin-41/ws/plugins/api/discovery/pom.xml>
to /home/jenkins/jenkins-slave/maven-repositories/1/org/apache/cloudstack/cloud-plugin-api-discovery/4.1.1-SNAPSHOT/cloud-plugin-api-discovery-4.1.1-SNAPSHOT.pom
[INFO] [INFO] Deleting <https://builds.apache.org/job/cloudstack-marvin-41/ws/plugins/acl/static-role-based/target>
                                                                        
[INFO] ------------------------------------------------------------------------
[INFO] Building Apache CloudStack Plugin - ACL Static Role Based 4.1.1-SNAPSHOT
[INFO] ------------------------------------------------------------------------
[INFO] 
[INFO] --- maven-clean-plugin:2.5:clean (default-clean) @ cloud-plugin-acl-static-role-based
---
[INFO] 
[INFO] --- maven-remote-resources-plugin:1.3:process (default) @ cloud-plugin-acl-static-role-based
---
[INFO] [debug] execute contextualize
[INFO] Using 'UTF-8' encoding to copy filtered resources.
[INFO] skip non existing resourceDirectory <https://builds.apache.org/job/cloudstack-marvin-41/ws/plugins/acl/static-role-based/src/main/resources>
[INFO] Copying 3 resources

[INFO] --- maven-resources-plugin:2.5:resources (default-resources) @ cloud-plugin-acl-static-role-based
---
[INFO] [INFO] Compiling 1 source file to <https://builds.apache.org/job/cloudstack-marvin-41/ws/plugins/acl/static-role-based/target/classes>

[INFO] --- maven-compiler-plugin:2.5.1:compile (default-compile) @ cloud-plugin-acl-static-role-based
---
[debug] execute contextualize
[INFO] [INFO] Using 'UTF-8' encoding to copy filtered resources.
[INFO] skip non existing resourceDirectory <https://builds.apache.org/job/cloudstack-marvin-41/ws/plugins/acl/static-role-based/src/test/resources>
[INFO] Copying 3 resources

[INFO] --- maven-resources-plugin:2.5:testResources (default-testResources) @ cloud-plugin-acl-static-role-based
---
[INFO] [INFO] No sources to compile

[INFO] --- maven-compiler-plugin:2.5.1:testCompile (default-testCompile) @ cloud-plugin-acl-static-role-based
---
[INFO] [INFO] Surefire report directory: <https://builds.apache.org/job/cloudstack-marvin-41/ws/plugins/acl/static-role-based/target/surefire-reports>

-------------------------------------------------------
 T E S T S
-------------------------------------------------------

[INFO] --- maven-surefire-plugin:2.12:test (default-test) @ cloud-plugin-acl-static-role-based
---

Results :

Tests run: 0, Failures: 0, Errors: 0, Skipped: 0

[JENKINS] Recording test results
[INFO] [INFO] Building jar: <https://builds.apache.org/job/cloudstack-marvin-41/ws/plugins/acl/static-role-based/target/cloud-plugin-acl-static-role-based-4.1.1-SNAPSHOT.jar>

[INFO] --- maven-jar-plugin:2.4:jar (default-jar) @ cloud-plugin-acl-static-role-based ---
[INFO] 
[INFO] --- maven-site-plugin:3.1:attach-descriptor (attach-descriptor) @ cloud-plugin-acl-static-role-based
---
[INFO] Installing <https://builds.apache.org/job/cloudstack-marvin-41/ws/plugins/acl/static-role-based/target/cloud-plugin-acl-static-role-based-4.1.1-SNAPSHOT.jar>
to /home/jenkins/jenkins-slave/maven-repositories/1/org/apache/cloudstack/cloud-plugin-acl-static-role-based/4.1.1-SNAPSHOT/cloud-plugin-acl-static-role-based-4.1.1-SNAPSHOT.jar
[INFO] Installing <https://builds.apache.org/job/cloudstack-marvin-41/ws/plugins/acl/static-role-based/pom.xml>
to /home/jenkins/jenkins-slave/maven-repositories/1/org/apache/cloudstack/cloud-plugin-acl-static-role-based/4.1.1-SNAPSHOT/cloud-plugin-acl-static-role-based-4.1.1-SNAPSHOT.pom
[INFO] 
[INFO] --- maven-install-plugin:2.3.1:install (default-install) @ cloud-plugin-acl-static-role-based
---
[INFO] [INFO] Deleting <https://builds.apache.org/job/cloudstack-marvin-41/ws/plugins/deployment-planners/user-concentrated-pod/target>
                                                                        
[INFO] ------------------------------------------------------------------------
[INFO] Building Apache CloudStack Plugin - User Concentrated Pod Deployment Planner 4.1.1-SNAPSHOT
[INFO] ------------------------------------------------------------------------
[INFO] 
[INFO] --- maven-clean-plugin:2.5:clean (default-clean) @ cloud-plugin-planner-user-concentrated-pod
---
[INFO] 
[INFO] --- maven-remote-resources-plugin:1.3:process (default) @ cloud-plugin-planner-user-concentrated-pod
---
[INFO] [debug] execute contextualize
[INFO] Using 'UTF-8' encoding to copy filtered resources.
[INFO] skip non existing resourceDirectory <https://builds.apache.org/job/cloudstack-marvin-41/ws/plugins/deployment-planners/user-concentrated-pod/src/main/resources>
[INFO] Copying 3 resources

[INFO] --- maven-resources-plugin:2.5:resources (default-resources) @ cloud-plugin-planner-user-concentrated-pod
---
[INFO] [INFO] Compiling 1 source file to <https://builds.apache.org/job/cloudstack-marvin-41/ws/plugins/deployment-planners/user-concentrated-pod/target/classes>

[INFO] --- maven-compiler-plugin:2.5.1:compile (default-compile) @ cloud-plugin-planner-user-concentrated-pod
---
[INFO] [debug] execute contextualize
[INFO] Using 'UTF-8' encoding to copy filtered resources.
[INFO] skip non existing resourceDirectory <https://builds.apache.org/job/cloudstack-marvin-41/ws/plugins/deployment-planners/user-concentrated-pod/src/test/resources>
[INFO] Copying 3 resources

[INFO] --- maven-resources-plugin:2.5:testResources (default-testResources) @ cloud-plugin-planner-user-concentrated-pod
---
[INFO] [INFO] No sources to compile

[INFO] --- maven-compiler-plugin:2.5.1:testCompile (default-testCompile) @ cloud-plugin-planner-user-concentrated-pod
---
[INFO] [INFO] Surefire report directory: <https://builds.apache.org/job/cloudstack-marvin-41/ws/plugins/deployment-planners/user-concentrated-pod/target/surefire-reports>

-------------------------------------------------------
 T E S T S
-------------------------------------------------------

[INFO] --- maven-surefire-plugin:2.12:test (default-test) @ cloud-plugin-planner-user-concentrated-pod
---

Results :

Tests run: 0, Failures: 0, Errors: 0, Skipped: 0

[JENKINS] Recording test results
[INFO] [INFO] Building jar: <https://builds.apache.org/job/cloudstack-marvin-41/ws/plugins/deployment-planners/user-concentrated-pod/target/cloud-plugin-planner-user-concentrated-pod-4.1.1-SNAPSHOT.jar>

[INFO] --- maven-jar-plugin:2.4:jar (default-jar) @ cloud-plugin-planner-user-concentrated-pod
---
[INFO] 
[INFO] --- maven-site-plugin:3.1:attach-descriptor (attach-descriptor) @ cloud-plugin-planner-user-concentrated-pod
---
[INFO] [INFO] Installing <https://builds.apache.org/job/cloudstack-marvin-41/ws/plugins/deployment-planners/user-concentrated-pod/target/cloud-plugin-planner-user-concentrated-pod-4.1.1-SNAPSHOT.jar>
to /home/jenkins/jenkins-slave/maven-repositories/1/org/apache/cloudstack/cloud-plugin-planner-user-concentrated-pod/4.1.1-SNAPSHOT/cloud-plugin-planner-user-concentrated-pod-4.1.1-SNAPSHOT.jar
[INFO] Installing <https://builds.apache.org/job/cloudstack-marvin-41/ws/plugins/deployment-planners/user-concentrated-pod/pom.xml>
to /home/jenkins/jenkins-slave/maven-repositories/1/org/apache/cloudstack/cloud-plugin-planner-user-concentrated-pod/4.1.1-SNAPSHOT/cloud-plugin-planner-user-concentrated-pod-4.1.1-SNAPSHOT.pom

[INFO] --- maven-install-plugin:2.3.1:install (default-install) @ cloud-plugin-planner-user-concentrated-pod
---
[INFO] [INFO] Deleting <https://builds.apache.org/job/cloudstack-marvin-41/ws/plugins/deployment-planners/user-dispersing/target>
                                                                        
[INFO] ------------------------------------------------------------------------
[INFO] Building Apache CloudStack Plugin - User Dispersing Deployment Planner 4.1.1-SNAPSHOT
[INFO] ------------------------------------------------------------------------
[INFO] 
[INFO] --- maven-clean-plugin:2.5:clean (default-clean) @ cloud-plugin-planner-user-dispersing
---
[INFO] 
[INFO] --- maven-remote-resources-plugin:1.3:process (default) @ cloud-plugin-planner-user-dispersing
---
[debug] execute contextualize
[INFO] [INFO] Using 'UTF-8' encoding to copy filtered resources.
[INFO] skip non existing resourceDirectory <https://builds.apache.org/job/cloudstack-marvin-41/ws/plugins/deployment-planners/user-dispersing/src/main/resources>
[INFO] Copying 3 resources

[INFO] --- maven-resources-plugin:2.5:resources (default-resources) @ cloud-plugin-planner-user-dispersing
---
[INFO] [INFO] Compiling 1 source file to <https://builds.apache.org/job/cloudstack-marvin-41/ws/plugins/deployment-planners/user-dispersing/target/classes>

[INFO] --- maven-compiler-plugin:2.5.1:compile (default-compile) @ cloud-plugin-planner-user-dispersing
---
[INFO] [debug] execute contextualize
[INFO] Using 'UTF-8' encoding to copy filtered resources.
[INFO] skip non existing resourceDirectory <https://builds.apache.org/job/cloudstack-marvin-41/ws/plugins/deployment-planners/user-dispersing/src/test/resources>
[INFO] Copying 3 resources

[INFO] --- maven-resources-plugin:2.5:testResources (default-testResources) @ cloud-plugin-planner-user-dispersing
---
[INFO] [INFO] No sources to compile

[INFO] --- maven-compiler-plugin:2.5.1:testCompile (default-testCompile) @ cloud-plugin-planner-user-dispersing
---
[INFO] [INFO] Surefire report directory: <https://builds.apache.org/job/cloudstack-marvin-41/ws/plugins/deployment-planners/user-dispersing/target/surefire-reports>

-------------------------------------------------------
 T E S T S
-------------------------------------------------------

[INFO] --- maven-surefire-plugin:2.12:test (default-test) @ cloud-plugin-planner-user-dispersing
---

Results :

Tests run: 0, Failures: 0, Errors: 0, Skipped: 0

[JENKINS] Recording test results
[INFO] 
[INFO] --- maven-jar-plugin:2.4:jar (default-jar) @ cloud-plugin-planner-user-dispersing ---
[INFO] Building jar: <https://builds.apache.org/job/cloudstack-marvin-41/ws/plugins/deployment-planners/user-dispersing/target/cloud-plugin-planner-user-dispersing-4.1.1-SNAPSHOT.jar>
[INFO] 
[INFO] --- maven-site-plugin:3.1:attach-descriptor (attach-descriptor) @ cloud-plugin-planner-user-dispersing
---
[INFO] [INFO] Installing <https://builds.apache.org/job/cloudstack-marvin-41/ws/plugins/deployment-planners/user-dispersing/target/cloud-plugin-planner-user-dispersing-4.1.1-SNAPSHOT.jar>
to /home/jenkins/jenkins-slave/maven-repositories/1/org/apache/cloudstack/cloud-plugin-planner-user-dispersing/4.1.1-SNAPSHOT/cloud-plugin-planner-user-dispersing-4.1.1-SNAPSHOT.jar
[INFO] Installing <https://builds.apache.org/job/cloudstack-marvin-41/ws/plugins/deployment-planners/user-dispersing/pom.xml>
to /home/jenkins/jenkins-slave/maven-repositories/1/org/apache/cloudstack/cloud-plugin-planner-user-dispersing/4.1.1-SNAPSHOT/cloud-plugin-planner-user-dispersing-4.1.1-SNAPSHOT.pom

[INFO] --- maven-install-plugin:2.3.1:install (default-install) @ cloud-plugin-planner-user-dispersing
---
[INFO]                                                                         
[INFO] ------------------------------------------------------------------------
[INFO] Building Apache CloudStack Plugin - Host Allocator Random 4.1.1-SNAPSHOT
[INFO] ------------------------------------------------------------------------
[INFO] Deleting <https://builds.apache.org/job/cloudstack-marvin-41/ws/plugins/host-allocators/random/target>
[INFO] 
[INFO] --- maven-clean-plugin:2.5:clean (default-clean) @ cloud-plugin-host-allocator-random
---
[INFO] 
[INFO] --- maven-remote-resources-plugin:1.3:process (default) @ cloud-plugin-host-allocator-random
---
[debug] execute contextualize
[INFO] Using 'UTF-8' encoding to copy filtered resources.
[INFO] skip non existing resourceDirectory <https://builds.apache.org/job/cloudstack-marvin-41/ws/plugins/host-allocators/random/src/main/resources>
[INFO] Copying 3 resources
[INFO] 
[INFO] --- maven-resources-plugin:2.5:resources (default-resources) @ cloud-plugin-host-allocator-random
---
[INFO] [INFO] Compiling 1 source file to <https://builds.apache.org/job/cloudstack-marvin-41/ws/plugins/host-allocators/random/target/classes>

[INFO] --- maven-compiler-plugin:2.5.1:compile (default-compile) @ cloud-plugin-host-allocator-random
---
[debug] execute contextualize
[INFO] [INFO] Using 'UTF-8' encoding to copy filtered resources.
[INFO] skip non existing resourceDirectory <https://builds.apache.org/job/cloudstack-marvin-41/ws/plugins/host-allocators/random/src/test/resources>
[INFO] Copying 3 resources

[INFO] --- maven-resources-plugin:2.5:testResources (default-testResources) @ cloud-plugin-host-allocator-random
---
[INFO] [INFO] No sources to compile

[INFO] --- maven-compiler-plugin:2.5.1:testCompile (default-testCompile) @ cloud-plugin-host-allocator-random
---
[INFO] [INFO] Surefire report directory: <https://builds.apache.org/job/cloudstack-marvin-41/ws/plugins/host-allocators/random/target/surefire-reports>

-------------------------------------------------------
 T E S T S
-------------------------------------------------------

[INFO] --- maven-surefire-plugin:2.12:test (default-test) @ cloud-plugin-host-allocator-random
---

Results :

Tests run: 0, Failures: 0, Errors: 0, Skipped: 0

[JENKINS] Recording test results
[INFO] Building jar: <https://builds.apache.org/job/cloudstack-marvin-41/ws/plugins/host-allocators/random/target/cloud-plugin-host-allocator-random-4.1.1-SNAPSHOT.jar>
[INFO] 
[INFO] --- maven-jar-plugin:2.4:jar (default-jar) @ cloud-plugin-host-allocator-random ---
[INFO] 
[INFO] --- maven-site-plugin:3.1:attach-descriptor (attach-descriptor) @ cloud-plugin-host-allocator-random
---
[INFO] [INFO] Installing <https://builds.apache.org/job/cloudstack-marvin-41/ws/plugins/host-allocators/random/target/cloud-plugin-host-allocator-random-4.1.1-SNAPSHOT.jar>
to /home/jenkins/jenkins-slave/maven-repositories/1/org/apache/cloudstack/cloud-plugin-host-allocator-random/4.1.1-SNAPSHOT/cloud-plugin-host-allocator-random-4.1.1-SNAPSHOT.jar
[INFO] Installing <https://builds.apache.org/job/cloudstack-marvin-41/ws/plugins/host-allocators/random/pom.xml>
to /home/jenkins/jenkins-slave/maven-repositories/1/org/apache/cloudstack/cloud-plugin-host-allocator-random/4.1.1-SNAPSHOT/cloud-plugin-host-allocator-random-4.1.1-SNAPSHOT.pom

[INFO] --- maven-install-plugin:2.3.1:install (default-install) @ cloud-plugin-host-allocator-random
---
[INFO] [INFO] Deleting <https://builds.apache.org/job/cloudstack-marvin-41/ws/plugins/hypervisors/ovm/target>
                                                                        
[INFO] ------------------------------------------------------------------------
[INFO] Building Apache CloudStack Plugin - Hypervisor OracleVM 4.1.1-SNAPSHOT
[INFO] ------------------------------------------------------------------------
[INFO] 
[INFO] --- maven-clean-plugin:2.5:clean (default-clean) @ cloud-plugin-hypervisor-ovm ---
[INFO] 
[INFO] --- maven-remote-resources-plugin:1.3:process (default) @ cloud-plugin-hypervisor-ovm
---
[INFO] [debug] execute contextualize
[INFO] Using 'UTF-8' encoding to copy filtered resources.
[INFO] skip non existing resourceDirectory <https://builds.apache.org/job/cloudstack-marvin-41/ws/plugins/hypervisors/ovm/src/main/resources>
[INFO] Copying 3 resources

[INFO] --- maven-resources-plugin:2.5:resources (default-resources) @ cloud-plugin-hypervisor-ovm
---
[INFO] [INFO] Compiling 18 source files to <https://builds.apache.org/job/cloudstack-marvin-41/ws/plugins/hypervisors/ovm/target/classes>

[INFO] --- maven-compiler-plugin:2.5.1:compile (default-compile) @ cloud-plugin-hypervisor-ovm
---
[cloudstack-marvin-41] $ /bin/bash -xe /tmp/hudson670134330163434638.sh
+ mvn -P developer -pl :cloud-apidoc -pl :cloud-marvin
[INFO] Scanning for projects...
[INFO] ------------------------------------------------------------------------
[INFO] Reactor Build Order:
[INFO] 
[INFO] Apache CloudStack apidoc Tools
[INFO] Apache CloudStack Developer Tools: marvin
[INFO]                                                                         
[INFO] ------------------------------------------------------------------------
[INFO] Building Apache CloudStack apidoc Tools 4.1.1-SNAPSHOT
[INFO] ------------------------------------------------------------------------
[INFO] ------------------------------------------------------------------------
[INFO] Reactor Summary:
[INFO] 
[INFO] Apache CloudStack apidoc Tools .................... FAILURE [0.484s]
[INFO] Apache CloudStack Developer Tools: marvin ......... SKIPPED
[INFO] ------------------------------------------------------------------------
[INFO] BUILD FAILURE
[INFO] ------------------------------------------------------------------------
[INFO] Total time: 1.666s
[INFO] Finished at: Wed Jul 10 12:46:21 UTC 2013
[INFO] Final Memory: 11M/79M
[INFO] ------------------------------------------------------------------------
[ERROR] Failed to execute goal on project cloud-apidoc: Could not resolve dependencies for
project org.apache.cloudstack:cloud-apidoc:pom:4.1.1-SNAPSHOT: Failure to find org.apache.cloudstack:cloud-client-ui:war:4.1.1-SNAPSHOT
in http://repository.apache.org/snapshots was cached in the local repository, resolution will
not be reattempted until the update interval of Nexus has elapsed or updates are forced ->
[Help 1]
[ERROR] 
[ERROR] To see the full stack trace of the errors, re-run Maven with the -e switch.
[ERROR] Re-run Maven using the -X switch to enable full debug logging.
[ERROR] 
[ERROR] For more information about the errors and possible solutions, please read the following
articles:
[ERROR] [Help 1] http://cwiki.apache.org/confluence/display/MAVEN/DependencyResolutionException
Build step 'Execute shell' marked build as failure
ERROR: Maven JVM terminated unexpectedly with exit code 143
Archiving artifacts

Mime
View raw message