cloudstack-commits mailing list archives

Site index · List index
Message view « Date » · « Thread »
Top « Date » · « Thread »
From Apache Jenkins Server <jenk...@builds.apache.org>
Subject Build failed in Jenkins: cloudstack-apidocs-41 #473
Date Wed, 03 Jul 2013 09:32:51 GMT
See <https://builds.apache.org/job/cloudstack-apidocs-41/473/>

------------------------------------------
[...truncated 3063 lines...]
[INFO] Installing <https://builds.apache.org/job/cloudstack-apidocs-41/ws/test/pom.xml>
to /home/jenkins/jenkins-slave/maven-repositories/1/org/apache/cloudstack/cloud-testclient/4.1.1-SNAPSHOT/cloud-testclient-4.1.1-SNAPSHOT.pom
[INFO] Installing <https://builds.apache.org/job/cloudstack-apidocs-41/ws/test/target/cloud-testclient-4.1.1-SNAPSHOT-tests.jar>
to /home/jenkins/jenkins-slave/maven-repositories/1/org/apache/cloudstack/cloud-testclient/4.1.1-SNAPSHOT/cloud-testclient-4.1.1-SNAPSHOT-tests.jar

[INFO] --- maven-install-plugin:2.3.1:install (default-install) @ cloud-testclient ---
[INFO] [INFO] Deleting <https://builds.apache.org/job/cloudstack-apidocs-41/ws/engine/storage/integration-test/target>
                                                                        
[INFO] ------------------------------------------------------------------------
[INFO] Building Apache CloudStack Engine Storage integration test Component 4.1.1-SNAPSHOT
[INFO] ------------------------------------------------------------------------
[INFO] 
[INFO] --- maven-clean-plugin:2.5:clean (default-clean) @ cloud-engine-storage-integration-test
---
[INFO] 
[INFO] --- maven-remote-resources-plugin:1.3:process (default) @ cloud-engine-storage-integration-test
---
[INFO] [debug] execute contextualize
[INFO] Using 'UTF-8' encoding to copy filtered resources.
[INFO] skip non existing resourceDirectory <https://builds.apache.org/job/cloudstack-apidocs-41/ws/engine/storage/integration-test/src/main/resources>
[INFO] Copying 3 resources

[INFO] --- maven-resources-plugin:2.5:resources (default-resources) @ cloud-engine-storage-integration-test
---
[INFO] [INFO] No sources to compile

[INFO] --- maven-compiler-plugin:2.5.1:compile (default-compile) @ cloud-engine-storage-integration-test
---
[debug] execute contextualize
[INFO] [INFO] Using 'UTF-8' encoding to copy filtered resources.
[INFO] Copying 2 resources
[INFO] Copying 3 resources

[INFO] --- maven-resources-plugin:2.5:testResources (default-testResources) @ cloud-engine-storage-integration-test
---
[INFO] Compiling 18 source files to <https://builds.apache.org/job/cloudstack-apidocs-41/ws/engine/storage/integration-test/target/test-classes>
[INFO] 
[INFO] --- maven-compiler-plugin:2.5.1:testCompile (default-testCompile) @ cloud-engine-storage-integration-test
---
[INFO] [INFO] Nothing to compile - all classes are up to date

[INFO] --- maven-compiler-plugin:2.5.1:testCompile (default) @ cloud-engine-storage-integration-test
---
[INFO] [INFO] Tests are skipped.

[INFO] --- maven-surefire-plugin:2.12:test (default-test) @ cloud-engine-storage-integration-test
---
[INFO] Building jar: <https://builds.apache.org/job/cloudstack-apidocs-41/ws/engine/storage/integration-test/target/cloud-engine-storage-integration-test-4.1.1-SNAPSHOT.jar>
[INFO] 
[INFO] --- maven-jar-plugin:2.4:jar (default-jar) @ cloud-engine-storage-integration-test
---
[INFO] 
[INFO] --- maven-site-plugin:3.1:attach-descriptor (attach-descriptor) @ cloud-engine-storage-integration-test
---
[INFO] [INFO] Tests are skipped.

[INFO] --- maven-surefire-plugin:2.12:test (default) @ cloud-engine-storage-integration-test
---
[INFO] [INFO] Installing <https://builds.apache.org/job/cloudstack-apidocs-41/ws/engine/storage/integration-test/target/cloud-engine-storage-integration-test-4.1.1-SNAPSHOT.jar>
to /home/jenkins/jenkins-slave/maven-repositories/1/org/apache/cloudstack/cloud-engine-storage-integration-test/4.1.1-SNAPSHOT/cloud-engine-storage-integration-test-4.1.1-SNAPSHOT.jar
[INFO] Installing <https://builds.apache.org/job/cloudstack-apidocs-41/ws/engine/storage/integration-test/pom.xml>
to /home/jenkins/jenkins-slave/maven-repositories/1/org/apache/cloudstack/cloud-engine-storage-integration-test/4.1.1-SNAPSHOT/cloud-engine-storage-integration-test-4.1.1-SNAPSHOT.pom

[INFO] --- maven-install-plugin:2.3.1:install (default-install) @ cloud-engine-storage-integration-test
---
[INFO] [INFO] Deleting <https://builds.apache.org/job/cloudstack-apidocs-41/ws/engine/service/target>
                                                                        
[INFO] ------------------------------------------------------------------------
[INFO] Building Apache CloudStack Cloud Engine Service 4.1.1-SNAPSHOT
[INFO] ------------------------------------------------------------------------
[INFO] 
[INFO] --- maven-clean-plugin:2.5:clean (default-clean) @ cloud-engine-service ---
[INFO] 
[INFO] --- maven-remote-resources-plugin:1.3:process (default) @ cloud-engine-service ---
[debug] execute contextualize
[INFO] [INFO] Using 'UTF-8' encoding to copy filtered resources.
[INFO] skip non existing resourceDirectory <https://builds.apache.org/job/cloudstack-apidocs-41/ws/engine/service/src/main/resources>
[INFO] Copying 3 resources

[INFO] --- maven-resources-plugin:2.5:resources (default-resources) @ cloud-engine-service
---
[INFO] [INFO] Nothing to compile - all classes are up to date

[INFO] --- maven-compiler-plugin:2.5.1:compile (default-compile) @ cloud-engine-service ---
[debug] execute contextualize
[INFO] [INFO] Using 'UTF-8' encoding to copy filtered resources.
[INFO] skip non existing resourceDirectory <https://builds.apache.org/job/cloudstack-apidocs-41/ws/engine/service/src/test/resources>
[INFO] Copying 3 resources

[INFO] --- maven-resources-plugin:2.5:testResources (default-testResources) @ cloud-engine-service
---
[INFO] [INFO] No sources to compile

[INFO] --- maven-compiler-plugin:2.5.1:testCompile (default-testCompile) @ cloud-engine-service
---
[INFO] Surefire report directory: <https://builds.apache.org/job/cloudstack-apidocs-41/ws/engine/service/target/surefire-reports>
[INFO] 
-------------------------------------------------------
 T E S T S
-------------------------------------------------------

[INFO] --- maven-surefire-plugin:2.12:test (default-test) @ cloud-engine-service ---

Results :

Tests run: 0, Failures: 0, Errors: 0, Skipped: 0

[JENKINS] Recording test results
[INFO] 
[INFO] --- maven-war-plugin:2.1.1:war (default-war) @ cloud-engine-service ---
[INFO] Packaging webapp
[INFO] Assembling webapp [cloud-engine-service] in [<https://builds.apache.org/job/cloudstack-apidocs-41/ws/engine/service/target/engine]>
[INFO] Processing war project
[INFO] Copying webapp resources [<https://builds.apache.org/job/cloudstack-apidocs-41/ws/engine/service/src/main/webapp]>
[INFO] Webapp assembled in [196 msecs]
[INFO] Building war: <https://builds.apache.org/job/cloudstack-apidocs-41/ws/engine/service/target/engine.war>
[INFO] WEB-INF/web.xml already added, skipping
[INFO] 
[INFO] --- maven-site-plugin:3.1:attach-descriptor (attach-descriptor) @ cloud-engine-service
---
[INFO] [INFO] Installing <https://builds.apache.org/job/cloudstack-apidocs-41/ws/engine/service/target/engine.war>
to /home/jenkins/jenkins-slave/maven-repositories/1/org/apache/cloudstack/cloud-engine-service/4.1.1-SNAPSHOT/cloud-engine-service-4.1.1-SNAPSHOT.war

[INFO] --- maven-install-plugin:2.3.1:install (default-install) @ cloud-engine-service ---
[INFO] Installing <https://builds.apache.org/job/cloudstack-apidocs-41/ws/engine/service/pom.xml>
to /home/jenkins/jenkins-slave/maven-repositories/1/org/apache/cloudstack/cloud-engine-service/4.1.1-SNAPSHOT/cloud-engine-service-4.1.1-SNAPSHOT.pom
[INFO] ------------------------------------------------------------------------
[INFO] Reactor Summary:
[INFO] 
[INFO] Apache CloudStack ................................. SUCCESS [28.705s]
[INFO] Apache CloudStack Utils ........................... SUCCESS [20.542s]
[INFO] Apache CloudStack API ............................. SUCCESS [11.206s]
[INFO] Apache CloudStack Core ............................ SUCCESS [4.417s]
[INFO] Apache CloudStack Agents .......................... SUCCESS [5.667s]
[INFO] Apache CloudStack SystemVM Patches ................ SUCCESS [1.029s]
[INFO] Apache CloudStack Console Proxy ................... SUCCESS [7.527s]
[INFO] Apache CloudStack Framework ....................... SUCCESS [0.518s]
[INFO] Apache CloudStack Framework - IPC ................. SUCCESS [3.129s]
[INFO] Apache CloudStack Framework - REST ................ SUCCESS [2.976s]
[INFO] Apache CloudStack Cloud Engine .................... SUCCESS [0.661s]
[INFO] Apache CloudStack Cloud Engine API ................ SUCCESS [3.151s]
[INFO] Apache CloudStack Framework - Event Notification .. SUCCESS [3.433s]
[INFO] Apache CloudStack Server .......................... SUCCESS [14.883s]
[INFO] Apache CloudStack Usage Server .................... SUCCESS [4.262s]
[INFO] Apache XenSource XAPI ............................. SUCCESS [5.901s]
[INFO] Apache CloudStack Plugin POM ...................... SUCCESS [0.826s]
[INFO] Apache CloudStack Plugin - API Rate Limit ......... SUCCESS [6.237s]
[INFO] Apache CloudStack Plugin - API Discovery .......... SUCCESS [3.900s]
[INFO] Apache CloudStack Plugin - ACL Static Role Based .. SUCCESS [2.507s]
[INFO] Apache CloudStack Plugin - User Concentrated Pod Deployment Planner  SUCCESS [3.420s]
[INFO] Apache CloudStack Plugin - User Dispersing Deployment Planner  SUCCESS [3.502s]
[INFO] Apache CloudStack Plugin - Host Allocator Random .. SUCCESS [2.735s]
[INFO] Apache CloudStack Plugin - Hypervisor OracleVM .... SUCCESS [3.195s]
[INFO] Apache CloudStack Cloud Engine Internal Components API  SUCCESS [2.905s]
[INFO] Apache CloudStack Engine Storage Component ........ SUCCESS [3.516s]
[INFO] Apache CloudStack Plugin - Open vSwitch ........... SUCCESS [3.681s]
[INFO] Apache CloudStack Plugin - Hypervisor Xen ......... SUCCESS [5.521s]
[INFO] Apache CloudStack Plugin - Hypervisor KVM ......... SUCCESS [4.850s]
[INFO] Apache CloudStack Plugin - RabbitMQ Event Bus ..... SUCCESS [2.781s]
[INFO] Apache CloudStack Plugin - Hypervisor Simulator ... SUCCESS [3.493s]
[INFO] Apache CloudStack Plugin - Network Elastic Load Balancer  SUCCESS [2.751s]
[INFO] Apache CloudStack Plugin - Network Nicira NVP ..... SUCCESS [5.571s]
[INFO] Apache CloudStack Plugin - BigSwitch Virtual Network Segment  SUCCESS [5.947s]
[INFO] Apache CloudStack Plugin - Storage Allocator Random  SUCCESS [3.227s]
[INFO] Apache CloudStack Plugin - User Authenticator LDAP  SUCCESS [3.072s]
[INFO] Apache CloudStack Plugin - User Authenticator MD5 . SUCCESS [2.865s]
[INFO] Apache CloudStack Plugin - User Authenticator Plain Text  SUCCESS [2.725s]
[INFO] Apache CloudStack Plugin - User Authenticator SHA256 Salted  SUCCESS [3.686s]
[INFO] Apache CloudStack Plugin - Dns Notifier Example ... SUCCESS [2.914s]
[INFO] Apache CloudStack Engine Storage Image Component .. SUCCESS [2.787s]
[INFO] Apache CloudStack Plugin - Storage Image S3 ....... SUCCESS [2.558s]
[INFO] Apache CloudStack Engine Storage Volume Component . SUCCESS [3.494s]
[INFO] Apache CloudStack Plugin - Storage Volume solidfire  SUCCESS [3.220s]
[INFO] Apache CloudStack Cloud Engine Compute Component .. SUCCESS [2.715s]
[INFO] Apache CloudStack Cloud Engine API ................ SUCCESS [2.434s]
[INFO] Apache CloudStack Cloud Engine Orchestration Component  SUCCESS [3.856s]
[INFO] Apache CloudStack Cloud Engine Schema Component ... SUCCESS [2.089s]
[INFO] Apache CloudStack Engine Storage Backup Component . SUCCESS [2.743s]
[INFO] Apache CloudStack Engine Storage Image Motion Component  SUCCESS [2.623s]
[INFO] Apache CloudStack Engine Storage Snapshot Component  SUCCESS [2.627s]
[INFO] Apache CloudStack Client UI ....................... SUCCESS [7.481s]
[INFO] Apache CloudStack Test ............................ SUCCESS [5.531s]
[INFO] Apache CloudStack Engine Storage integration test Component  SUCCESS [3.541s]
[INFO] Apache CloudStack Cloud Engine Service ............ SUCCESS [6.528s]
[INFO] ------------------------------------------------------------------------
[INFO] BUILD SUCCESS
[INFO] ------------------------------------------------------------------------
[INFO] Total time: 4:38.028s
[INFO] Finished at: Wed Jul 03 09:32:17 UTC 2013
[INFO] Final Memory: 36M/152M
[INFO] ------------------------------------------------------------------------
[JENKINS] Archiving disabled
[JENKINS] Archiving disabled
[JENKINS] Archiving disabled
[JENKINS] Archiving disabled
[JENKINS] Archiving disabled
[JENKINS] Archiving disabled
[JENKINS] Archiving disabled
[JENKINS] Archiving disabled
[JENKINS] Archiving disabled
[JENKINS] Archiving disabled
[JENKINS] Archiving disabled
[JENKINS] Archiving disabled
[JENKINS] Archiving disabled
[JENKINS] Archiving disabled
[JENKINS] Archiving disabled
[JENKINS] Archiving disabled
[JENKINS] Archiving disabled
[JENKINS] Archiving disabled
[JENKINS] Archiving disabled
[JENKINS] Archiving disabled
[JENKINS] Archiving disabled
[JENKINS] Archiving disabled
[JENKINS] Archiving disabled
[JENKINS] Archiving disabled
[JENKINS] Archiving disabled
[JENKINS] Archiving disabled
[JENKINS] Archiving disabled
[JENKINS] Archiving disabled
[JENKINS] Archiving disabled
[JENKINS] Archiving disabled
[JENKINS] Archiving disabled
[JENKINS] Archiving disabled
[JENKINS] Archiving disabled
[JENKINS] Archiving disabled
[JENKINS] Archiving disabled
[JENKINS] Archiving disabled
[JENKINS] Archiving disabled
[JENKINS] Archiving disabled
[JENKINS] Archiving disabled
[JENKINS] Archiving disabled
[JENKINS] Archiving disabled
[JENKINS] Archiving disabled
[JENKINS] Archiving disabled
[JENKINS] Archiving disabled
[JENKINS] Archiving disabled
[JENKINS] Archiving disabled
[JENKINS] Archiving disabled
[JENKINS] Archiving disabled
[JENKINS] Archiving disabled
[JENKINS] Archiving disabled
[JENKINS] Archiving disabled
[JENKINS] Archiving disabled
[JENKINS] Archiving disabled
[JENKINS] Archiving disabled
[JENKINS] Archiving disabled
Waiting for Jenkins to finish collecting data
channel stopped
[cloudstack-apidocs-41] $ /bin/bash -xe /tmp/hudson5692611707794675978.sh
+ mvn -P developer -pl :cloud-apidoc
[INFO] Scanning for projects...
[INFO]                                                                         
[INFO] ------------------------------------------------------------------------
[INFO] Building Apache CloudStack apidoc Tools 4.1.1-SNAPSHOT
[INFO] ------------------------------------------------------------------------
[INFO] ------------------------------------------------------------------------
[INFO] BUILD FAILURE
[INFO] ------------------------------------------------------------------------
[INFO] Total time: 1.562s
[INFO] Finished at: Wed Jul 03 09:32:48 UTC 2013
[INFO] Final Memory: 12M/109M
[INFO] ------------------------------------------------------------------------
[ERROR] Failed to execute goal on project cloud-apidoc: Could not resolve dependencies for
project org.apache.cloudstack:cloud-apidoc:pom:4.1.1-SNAPSHOT: Failure to find org.apache.cloudstack:cloud-client-ui:war:4.1.1-SNAPSHOT
in http://repository.apache.org/snapshots was cached in the local repository, resolution will
not be reattempted until the update interval of Nexus has elapsed or updates are forced ->
[Help 1]
[ERROR] 
[ERROR] To see the full stack trace of the errors, re-run Maven with the -e switch.
[ERROR] Re-run Maven using the -X switch to enable full debug logging.
[ERROR] 
[ERROR] For more information about the errors and possible solutions, please read the following
articles:
[ERROR] [Help 1] http://cwiki.apache.org/confluence/display/MAVEN/DependencyResolutionException
Build step 'Execute shell' marked build as failure
Archiving artifacts

Mime
View raw message