cloudstack-commits mailing list archives

Site index · List index
Message view « Date » · « Thread »
Top « Date » · « Thread »
From Apache Jenkins Server <jenk...@builds.apache.org>
Subject Build failed in Jenkins: cloudstack-apidocs-41 #478
Date Wed, 03 Jul 2013 15:47:58 GMT
See <https://builds.apache.org/job/cloudstack-apidocs-41/478/>

------------------------------------------
[...truncated 3061 lines...]
[INFO] [INFO] Installing <https://builds.apache.org/job/cloudstack-apidocs-41/ws/test/pom.xml>
to /home/jenkins/jenkins-slave/maven-repositories/1/org/apache/cloudstack/cloud-testclient/4.1.1-SNAPSHOT/cloud-testclient-4.1.1-SNAPSHOT.pom
[INFO] Installing <https://builds.apache.org/job/cloudstack-apidocs-41/ws/test/target/cloud-testclient-4.1.1-SNAPSHOT-tests.jar>
to /home/jenkins/jenkins-slave/maven-repositories/1/org/apache/cloudstack/cloud-testclient/4.1.1-SNAPSHOT/cloud-testclient-4.1.1-SNAPSHOT-tests.jar

[INFO] --- maven-install-plugin:2.3.1:install (default-install) @ cloud-testclient ---
[INFO] [INFO] Deleting <https://builds.apache.org/job/cloudstack-apidocs-41/ws/engine/storage/integration-test/target>
                                                                        
[INFO] ------------------------------------------------------------------------
[INFO] Building Apache CloudStack Engine Storage integration test Component 4.1.1-SNAPSHOT
[INFO] ------------------------------------------------------------------------
[INFO] 
[INFO] --- maven-clean-plugin:2.5:clean (default-clean) @ cloud-engine-storage-integration-test
---
[INFO] 
[INFO] --- maven-remote-resources-plugin:1.3:process (default) @ cloud-engine-storage-integration-test
---
[debug] execute contextualize
[INFO] [INFO] Using 'UTF-8' encoding to copy filtered resources.
[INFO] skip non existing resourceDirectory <https://builds.apache.org/job/cloudstack-apidocs-41/ws/engine/storage/integration-test/src/main/resources>
[INFO] Copying 3 resources

[INFO] --- maven-resources-plugin:2.5:resources (default-resources) @ cloud-engine-storage-integration-test
---
[INFO] [INFO] No sources to compile

[INFO] --- maven-compiler-plugin:2.5.1:compile (default-compile) @ cloud-engine-storage-integration-test
---
[INFO] [debug] execute contextualize
[INFO] Using 'UTF-8' encoding to copy filtered resources.
[INFO] Copying 2 resources
[INFO] Copying 3 resources

[INFO] --- maven-resources-plugin:2.5:testResources (default-testResources) @ cloud-engine-storage-integration-test
---
[INFO] [INFO] Compiling 18 source files to <https://builds.apache.org/job/cloudstack-apidocs-41/ws/engine/storage/integration-test/target/test-classes>

[INFO] --- maven-compiler-plugin:2.5.1:testCompile (default-testCompile) @ cloud-engine-storage-integration-test
---
[INFO] Nothing to compile - all classes are up to date
[INFO] 
[INFO] --- maven-compiler-plugin:2.5.1:testCompile (default) @ cloud-engine-storage-integration-test
---
[INFO] [INFO] Tests are skipped.

[INFO] --- maven-surefire-plugin:2.12:test (default-test) @ cloud-engine-storage-integration-test
---
[INFO] [INFO] Building jar: <https://builds.apache.org/job/cloudstack-apidocs-41/ws/engine/storage/integration-test/target/cloud-engine-storage-integration-test-4.1.1-SNAPSHOT.jar>

[INFO] --- maven-jar-plugin:2.4:jar (default-jar) @ cloud-engine-storage-integration-test
---
[INFO] 
[INFO] --- maven-site-plugin:3.1:attach-descriptor (attach-descriptor) @ cloud-engine-storage-integration-test
---
[INFO] [INFO] Tests are skipped.

[INFO] --- maven-surefire-plugin:2.12:test (default) @ cloud-engine-storage-integration-test
---
[INFO] [INFO] Installing <https://builds.apache.org/job/cloudstack-apidocs-41/ws/engine/storage/integration-test/target/cloud-engine-storage-integration-test-4.1.1-SNAPSHOT.jar>
to /home/jenkins/jenkins-slave/maven-repositories/1/org/apache/cloudstack/cloud-engine-storage-integration-test/4.1.1-SNAPSHOT/cloud-engine-storage-integration-test-4.1.1-SNAPSHOT.jar
[INFO] Installing <https://builds.apache.org/job/cloudstack-apidocs-41/ws/engine/storage/integration-test/pom.xml>
to /home/jenkins/jenkins-slave/maven-repositories/1/org/apache/cloudstack/cloud-engine-storage-integration-test/4.1.1-SNAPSHOT/cloud-engine-storage-integration-test-4.1.1-SNAPSHOT.pom

[INFO] --- maven-install-plugin:2.3.1:install (default-install) @ cloud-engine-storage-integration-test
---
[INFO]                                                                         
[INFO] ------------------------------------------------------------------------[INFO] Deleting
<https://builds.apache.org/job/cloudstack-apidocs-41/ws/engine/service/target>

[INFO] Building Apache CloudStack Cloud Engine Service 4.1.1-SNAPSHOT
[INFO] ------------------------------------------------------------------------
[INFO] 
[INFO] --- maven-clean-plugin:2.5:clean (default-clean) @ cloud-engine-service ---
[INFO] 
[INFO] --- maven-remote-resources-plugin:1.3:process (default) @ cloud-engine-service ---
[debug] execute contextualize
[INFO] [INFO] Using 'UTF-8' encoding to copy filtered resources.
[INFO] skip non existing resourceDirectory <https://builds.apache.org/job/cloudstack-apidocs-41/ws/engine/service/src/main/resources>
[INFO] Copying 3 resources

[INFO] --- maven-resources-plugin:2.5:resources (default-resources) @ cloud-engine-service
---
[INFO] [INFO] Nothing to compile - all classes are up to date

[INFO] --- maven-compiler-plugin:2.5.1:compile (default-compile) @ cloud-engine-service ---
[debug] execute contextualize
[INFO] [INFO] Using 'UTF-8' encoding to copy filtered resources.
[INFO] skip non existing resourceDirectory <https://builds.apache.org/job/cloudstack-apidocs-41/ws/engine/service/src/test/resources>
[INFO] Copying 3 resources

[INFO] --- maven-resources-plugin:2.5:testResources (default-testResources) @ cloud-engine-service
---
[INFO] [INFO] No sources to compile

[INFO] --- maven-compiler-plugin:2.5.1:testCompile (default-testCompile) @ cloud-engine-service
---
[INFO] [INFO] Surefire report directory: <https://builds.apache.org/job/cloudstack-apidocs-41/ws/engine/service/target/surefire-reports>

-------------------------------------------------------
 T E S T S
-------------------------------------------------------

[INFO] --- maven-surefire-plugin:2.12:test (default-test) @ cloud-engine-service ---

Results :

Tests run: 0, Failures: 0, Errors: 0, Skipped: 0

[JENKINS] Recording test results
[INFO] 
[INFO] --- maven-war-plugin:2.1.1:war (default-war) @ cloud-engine-service ---
[INFO] Packaging webapp
[INFO] Assembling webapp [cloud-engine-service] in [<https://builds.apache.org/job/cloudstack-apidocs-41/ws/engine/service/target/engine]>
[INFO] Processing war project
[INFO] Copying webapp resources [<https://builds.apache.org/job/cloudstack-apidocs-41/ws/engine/service/src/main/webapp]>
[INFO] Webapp assembled in [370 msecs]
[INFO] Building war: <https://builds.apache.org/job/cloudstack-apidocs-41/ws/engine/service/target/engine.war>
[INFO] 
[INFO] WEB-INF/web.xml already added, skipping
[INFO] --- maven-site-plugin:3.1:attach-descriptor (attach-descriptor) @ cloud-engine-service
---
[INFO] [INFO] Installing <https://builds.apache.org/job/cloudstack-apidocs-41/ws/engine/service/target/engine.war>
to /home/jenkins/jenkins-slave/maven-repositories/1/org/apache/cloudstack/cloud-engine-service/4.1.1-SNAPSHOT/cloud-engine-service-4.1.1-SNAPSHOT.war

[INFO] --- maven-install-plugin:2.3.1:install (default-install) @ cloud-engine-service ---
[INFO] Installing <https://builds.apache.org/job/cloudstack-apidocs-41/ws/engine/service/pom.xml>
to /home/jenkins/jenkins-slave/maven-repositories/1/org/apache/cloudstack/cloud-engine-service/4.1.1-SNAPSHOT/cloud-engine-service-4.1.1-SNAPSHOT.pom
[INFO] ------------------------------------------------------------------------
[INFO] Reactor Summary:
[INFO] 
[INFO] Apache CloudStack ................................. SUCCESS [23.320s]
[INFO] Apache CloudStack Utils ........................... SUCCESS [19.125s]
[INFO] Apache CloudStack API ............................. SUCCESS [12.965s]
[INFO] Apache CloudStack Core ............................ SUCCESS [6.615s]
[INFO] Apache CloudStack Agents .......................... SUCCESS [6.161s]
[INFO] Apache CloudStack SystemVM Patches ................ SUCCESS [1.538s]
[INFO] Apache CloudStack Console Proxy ................... SUCCESS [8.785s]
[INFO] Apache CloudStack Framework ....................... SUCCESS [0.839s]
[INFO] Apache CloudStack Framework - IPC ................. SUCCESS [5.340s]
[INFO] Apache CloudStack Framework - REST ................ SUCCESS [3.373s]
[INFO] Apache CloudStack Cloud Engine .................... SUCCESS [0.772s]
[INFO] Apache CloudStack Cloud Engine API ................ SUCCESS [3.764s]
[INFO] Apache CloudStack Framework - Event Notification .. SUCCESS [3.169s]
[INFO] Apache CloudStack Server .......................... SUCCESS [20.846s]
[INFO] Apache CloudStack Usage Server .................... SUCCESS [6.088s]
[INFO] Apache XenSource XAPI ............................. SUCCESS [4.844s]
[INFO] Apache CloudStack Plugin POM ...................... SUCCESS [0.836s]
[INFO] Apache CloudStack Plugin - API Rate Limit ......... SUCCESS [7.442s]
[INFO] Apache CloudStack Plugin - API Discovery .......... SUCCESS [4.120s]
[INFO] Apache CloudStack Plugin - ACL Static Role Based .. SUCCESS [2.704s]
[INFO] Apache CloudStack Plugin - User Concentrated Pod Deployment Planner  SUCCESS [3.323s]
[INFO] Apache CloudStack Plugin - User Dispersing Deployment Planner  SUCCESS [3.338s]
[INFO] Apache CloudStack Plugin - Host Allocator Random .. SUCCESS [3.688s]
[INFO] Apache CloudStack Plugin - Hypervisor OracleVM .... SUCCESS [3.453s]
[INFO] Apache CloudStack Cloud Engine Internal Components API  SUCCESS [2.948s]
[INFO] Apache CloudStack Engine Storage Component ........ SUCCESS [4.083s]
[INFO] Apache CloudStack Plugin - Open vSwitch ........... SUCCESS [3.401s]
[INFO] Apache CloudStack Plugin - Hypervisor Xen ......... SUCCESS [4.528s]
[INFO] Apache CloudStack Plugin - Hypervisor KVM ......... SUCCESS [5.383s]
[INFO] Apache CloudStack Plugin - RabbitMQ Event Bus ..... SUCCESS [3.844s]
[INFO] Apache CloudStack Plugin - Hypervisor Simulator ... SUCCESS [4.098s]
[INFO] Apache CloudStack Plugin - Network Elastic Load Balancer  SUCCESS [3.702s]
[INFO] Apache CloudStack Plugin - Network Nicira NVP ..... SUCCESS [6.621s]
[INFO] Apache CloudStack Plugin - BigSwitch Virtual Network Segment  SUCCESS [5.324s]
[INFO] Apache CloudStack Plugin - Storage Allocator Random  SUCCESS [3.420s]
[INFO] Apache CloudStack Plugin - User Authenticator LDAP  SUCCESS [3.106s]
[INFO] Apache CloudStack Plugin - User Authenticator MD5 . SUCCESS [2.857s]
[INFO] Apache CloudStack Plugin - User Authenticator Plain Text  SUCCESS [3.071s]
[INFO] Apache CloudStack Plugin - User Authenticator SHA256 Salted  SUCCESS [14.706s]
[INFO] Apache CloudStack Plugin - Dns Notifier Example ... SUCCESS [3.009s]
[INFO] Apache CloudStack Engine Storage Image Component .. SUCCESS [3.498s]
[INFO] Apache CloudStack Plugin - Storage Image S3 ....... SUCCESS [2.781s]
[INFO] Apache CloudStack Engine Storage Volume Component . SUCCESS [4.187s]
[INFO] Apache CloudStack Plugin - Storage Volume solidfire  SUCCESS [3.941s]
[INFO] Apache CloudStack Cloud Engine Compute Component .. SUCCESS [2.953s]
[INFO] Apache CloudStack Cloud Engine API ................ SUCCESS [2.591s]
[INFO] Apache CloudStack Cloud Engine Orchestration Component  SUCCESS [4.211s]
[INFO] Apache CloudStack Cloud Engine Schema Component ... SUCCESS [4.819s]
[INFO] Apache CloudStack Engine Storage Backup Component . SUCCESS [3.113s]
[INFO] Apache CloudStack Engine Storage Image Motion Component  SUCCESS [3.493s]
[INFO] Apache CloudStack Engine Storage Snapshot Component  SUCCESS [4.499s]
[INFO] Apache CloudStack Client UI ....................... SUCCESS [13.796s]
[INFO] Apache CloudStack Test ............................ SUCCESS [7.079s]
[INFO] Apache CloudStack Engine Storage integration test Component  SUCCESS [4.120s]
[INFO] Apache CloudStack Cloud Engine Service ............ SUCCESS [9.368s]
[INFO] ------------------------------------------------------------------------
[INFO] BUILD SUCCESS
[INFO] ------------------------------------------------------------------------
[INFO] Total time: 5:24.493s
[INFO] Finished at: Wed Jul 03 15:46:57 UTC 2013
[INFO] Final Memory: 39M/167M
[INFO] ------------------------------------------------------------------------
[JENKINS] Archiving disabled
[JENKINS] Archiving disabled
[JENKINS] Archiving disabled
[JENKINS] Archiving disabled
[JENKINS] Archiving disabled
[JENKINS] Archiving disabled
[JENKINS] Archiving disabled
[JENKINS] Archiving disabled
[JENKINS] Archiving disabled
[JENKINS] Archiving disabled
[JENKINS] Archiving disabled
[JENKINS] Archiving disabled
[JENKINS] Archiving disabled
[JENKINS] Archiving disabled
[JENKINS] Archiving disabled
[JENKINS] Archiving disabled
[JENKINS] Archiving disabled
[JENKINS] Archiving disabled
[JENKINS] Archiving disabled
[JENKINS] Archiving disabled
[JENKINS] Archiving disabled
[JENKINS] Archiving disabled
[JENKINS] Archiving disabled
[JENKINS] Archiving disabled
[JENKINS] Archiving disabled
[JENKINS] Archiving disabled
[JENKINS] Archiving disabled
[JENKINS] Archiving disabled
[JENKINS] Archiving disabled
[JENKINS] Archiving disabled
[JENKINS] Archiving disabled
[JENKINS] Archiving disabled
[JENKINS] Archiving disabled
[JENKINS] Archiving disabled
[JENKINS] Archiving disabled
[JENKINS] Archiving disabled
[JENKINS] Archiving disabled
[JENKINS] Archiving disabled
[JENKINS] Archiving disabled
[JENKINS] Archiving disabled
[JENKINS] Archiving disabled
[JENKINS] Archiving disabled
[JENKINS] Archiving disabled
[JENKINS] Archiving disabled
[JENKINS] Archiving disabled
[JENKINS] Archiving disabled
[JENKINS] Archiving disabled
[JENKINS] Archiving disabled
[JENKINS] Archiving disabled
[JENKINS] Archiving disabled
[JENKINS] Archiving disabled
[JENKINS] Archiving disabled
[JENKINS] Archiving disabled
[JENKINS] Archiving disabled
[JENKINS] Archiving disabled
Waiting for Jenkins to finish collecting data
channel stopped
[cloudstack-apidocs-41] $ /bin/bash -xe /tmp/hudson8882548080130177308.sh
+ mvn -P developer -pl :cloud-apidoc
[INFO] Scanning for projects...
[INFO]                                                                         
[INFO] ------------------------------------------------------------------------
[INFO] Building Apache CloudStack apidoc Tools 4.1.1-SNAPSHOT
[INFO] ------------------------------------------------------------------------
[INFO] ------------------------------------------------------------------------
[INFO] BUILD FAILURE
[INFO] ------------------------------------------------------------------------
[INFO] Total time: 1.922s
[INFO] Finished at: Wed Jul 03 15:47:53 UTC 2013
[INFO] Final Memory: 11M/79M
[INFO] ------------------------------------------------------------------------
[ERROR] Failed to execute goal on project cloud-apidoc: Could not resolve dependencies for
project org.apache.cloudstack:cloud-apidoc:pom:4.1.1-SNAPSHOT: Failure to find org.apache.cloudstack:cloud-client-ui:war:4.1.1-SNAPSHOT
in http://repository.apache.org/snapshots was cached in the local repository, resolution will
not be reattempted until the update interval of Nexus has elapsed or updates are forced ->
[Help 1]
[ERROR] 
[ERROR] To see the full stack trace of the errors, re-run Maven with the -e switch.
[ERROR] Re-run Maven using the -X switch to enable full debug logging.
[ERROR] 
[ERROR] For more information about the errors and possible solutions, please read the following
articles:
[ERROR] [Help 1] http://cwiki.apache.org/confluence/display/MAVEN/DependencyResolutionException
Build step 'Execute shell' marked build as failure
Archiving artifacts

Mime
View raw message