cloudstack-commits mailing list archives

Site index · List index
Message view « Date » · « Thread »
Top « Date » · « Thread »
From Apache Jenkins Server <jenk...@builds.apache.org>
Subject Build failed in Jenkins: cloudstack-marvin-41 #402
Date Mon, 17 Jun 2013 19:10:51 GMT
See <https://builds.apache.org/job/cloudstack-marvin-41/402/changes>

Changes:

[chipchilders] Updating pom.xml version numbers for release 4.1.1-SNAPSHOT

[chipchilders] Bumping version to 4.1.1-SNAPSHOT and 4.1.1

[rohit.yadav] cloudmonkey: Fix asyncblock infinite recursion

[chipchilders] CLOUDSTACK-2902: Updating repository refs

[chipchilders] Correcting ID in the release notes from issues-fixed-4.0 to issues-fixed-4.1

[chip.childers] Fixing XenServerJava pom.xml version number

------------------------------------------
[...truncated 3075 lines...]
[INFO] [INFO] Using 'UTF-8' encoding to copy filtered resources.
[INFO] skip non existing resourceDirectory <https://builds.apache.org/job/cloudstack-marvin-41/ws/engine/storage/integration-test/src/main/resources>
[INFO] Copying 3 resources

[INFO] --- maven-resources-plugin:2.5:resources (default-resources) @ cloud-engine-storage-integration-test
---
[INFO] [INFO] No sources to compile

[INFO] --- maven-compiler-plugin:2.5.1:compile (default-compile) @ cloud-engine-storage-integration-test
---
[debug] execute contextualize
[INFO] Using 'UTF-8' encoding to copy filtered resources.
[INFO] Copying 2 resources
[INFO] [INFO] Copying 3 resources

[INFO] --- maven-resources-plugin:2.5:testResources (default-testResources) @ cloud-engine-storage-integration-test
---
[INFO] [INFO] Compiling 18 source files to <https://builds.apache.org/job/cloudstack-marvin-41/ws/engine/storage/integration-test/target/test-classes>

[INFO] --- maven-compiler-plugin:2.5.1:testCompile (default-testCompile) @ cloud-engine-storage-integration-test
---
[INFO] [INFO] Nothing to compile - all classes are up to date

[INFO] --- maven-compiler-plugin:2.5.1:testCompile (default) @ cloud-engine-storage-integration-test
---
[INFO] [INFO] Tests are skipped.

[INFO] --- maven-surefire-plugin:2.12:test (default-test) @ cloud-engine-storage-integration-test
---
[INFO] [INFO] Building jar: <https://builds.apache.org/job/cloudstack-marvin-41/ws/engine/storage/integration-test/target/cloud-engine-storage-integration-test-4.1.1-SNAPSHOT.jar>

[INFO] --- maven-jar-plugin:2.4:jar (default-jar) @ cloud-engine-storage-integration-test
---
[INFO] 
[INFO] --- maven-site-plugin:3.1:attach-descriptor (attach-descriptor) @ cloud-engine-storage-integration-test
---
[INFO] [INFO] Tests are skipped.

[INFO] --- maven-surefire-plugin:2.12:test (default) @ cloud-engine-storage-integration-test
---
[INFO] [INFO] Installing <https://builds.apache.org/job/cloudstack-marvin-41/ws/engine/storage/integration-test/target/cloud-engine-storage-integration-test-4.1.1-SNAPSHOT.jar>
to /home/jenkins/jenkins-slave/maven-repositories/1/org/apache/cloudstack/cloud-engine-storage-integration-test/4.1.1-SNAPSHOT/cloud-engine-storage-integration-test-4.1.1-SNAPSHOT.jar

[INFO] --- maven-install-plugin:2.3.1:install (default-install) @ cloud-engine-storage-integration-test
---
[INFO] Installing <https://builds.apache.org/job/cloudstack-marvin-41/ws/engine/storage/integration-test/pom.xml>
to /home/jenkins/jenkins-slave/maven-repositories/1/org/apache/cloudstack/cloud-engine-storage-integration-test/4.1.1-SNAPSHOT/cloud-engine-storage-integration-test-4.1.1-SNAPSHOT.pom
[INFO]                                                                         
[INFO] ------------------------------------------------------------------------
[INFO] Building Apache CloudStack Cloud Engine Service 4.1.1-SNAPSHOT
[INFO] ------------------------------------------------------------------------
[INFO] Deleting <https://builds.apache.org/job/cloudstack-marvin-41/ws/engine/service/target>
[INFO] 
[INFO] --- maven-clean-plugin:2.5:clean (default-clean) @ cloud-engine-service ---
[INFO] 
[INFO] --- maven-remote-resources-plugin:1.3:process (default) @ cloud-engine-service ---
[INFO] [debug] execute contextualize
[INFO] Using 'UTF-8' encoding to copy filtered resources.
[INFO] skip non existing resourceDirectory <https://builds.apache.org/job/cloudstack-marvin-41/ws/engine/service/src/main/resources>
[INFO] Copying 3 resources

[INFO] --- maven-resources-plugin:2.5:resources (default-resources) @ cloud-engine-service
---
[INFO] [INFO] Nothing to compile - all classes are up to date

[INFO] --- maven-compiler-plugin:2.5.1:compile (default-compile) @ cloud-engine-service ---
[INFO] [debug] execute contextualize
[INFO] Using 'UTF-8' encoding to copy filtered resources.
[INFO] skip non existing resourceDirectory <https://builds.apache.org/job/cloudstack-marvin-41/ws/engine/service/src/test/resources>
[INFO] Copying 3 resources

[INFO] --- maven-resources-plugin:2.5:testResources (default-testResources) @ cloud-engine-service
---
[INFO] [INFO] No sources to compile

[INFO] --- maven-compiler-plugin:2.5.1:testCompile (default-testCompile) @ cloud-engine-service
---
[INFO] [INFO] Surefire report directory: <https://builds.apache.org/job/cloudstack-marvin-41/ws/engine/service/target/surefire-reports>

[INFO] --- maven-surefire-plugin:2.12:test (default-test) @ cloud-engine-service ---

-------------------------------------------------------
 T E S T S
-------------------------------------------------------

Results :

Tests run: 0, Failures: 0, Errors: 0, Skipped: 0

[JENKINS] Recording test results
[INFO] 
[INFO] --- maven-war-plugin:2.1.1:war (default-war) @ cloud-engine-service ---
[INFO] Packaging webapp
[INFO] Assembling webapp [cloud-engine-service] in [<https://builds.apache.org/job/cloudstack-marvin-41/ws/engine/service/target/engine]>
[INFO] Processing war project
[INFO] Copying webapp resources [<https://builds.apache.org/job/cloudstack-marvin-41/ws/engine/service/src/main/webapp]>
[INFO] Webapp assembled in [237 msecs]
[INFO] Building war: <https://builds.apache.org/job/cloudstack-marvin-41/ws/engine/service/target/engine.war>
[INFO] WEB-INF/web.xml already added, skipping
[INFO] 
[INFO] --- maven-site-plugin:3.1:attach-descriptor (attach-descriptor) @ cloud-engine-service
---
[INFO] Installing <https://builds.apache.org/job/cloudstack-marvin-41/ws/engine/service/target/engine.war>
to /home/jenkins/jenkins-slave/maven-repositories/1/org/apache/cloudstack/cloud-engine-service/4.1.1-SNAPSHOT/cloud-engine-service-4.1.1-SNAPSHOT.war
[INFO] 
[INFO] --- maven-install-plugin:2.3.1:install (default-install) @ cloud-engine-service ---
[INFO] Installing <https://builds.apache.org/job/cloudstack-marvin-41/ws/engine/service/pom.xml>
to /home/jenkins/jenkins-slave/maven-repositories/1/org/apache/cloudstack/cloud-engine-service/4.1.1-SNAPSHOT/cloud-engine-service-4.1.1-SNAPSHOT.pom
[INFO] ------------------------------------------------------------------------
[INFO] Reactor Summary:
[INFO] 
[INFO] Apache CloudStack ................................. SUCCESS [24.405s]
[INFO] Apache CloudStack Utils ........................... SUCCESS [29.297s]
[INFO] Apache CloudStack API ............................. SUCCESS [11.414s]
[INFO] Apache CloudStack Core ............................ SUCCESS [5.372s]
[INFO] Apache CloudStack Agents .......................... SUCCESS [8.341s]
[INFO] Apache CloudStack SystemVM Patches ................ SUCCESS [1.861s]
[INFO] Apache CloudStack Console Proxy ................... SUCCESS [9.346s]
[INFO] Apache CloudStack Framework ....................... SUCCESS [0.486s]
[INFO] Apache CloudStack Framework - IPC ................. SUCCESS [5.163s]
[INFO] Apache CloudStack Framework - REST ................ SUCCESS [5.445s]
[INFO] Apache CloudStack Cloud Engine .................... SUCCESS [0.641s]
[INFO] Apache CloudStack Cloud Engine API ................ SUCCESS [3.825s]
[INFO] Apache CloudStack Framework - Event Notification .. SUCCESS [3.613s]
[INFO] Apache CloudStack Server .......................... SUCCESS [23.501s]
[INFO] Apache CloudStack Usage Server .................... SUCCESS [5.692s]
[INFO] Apache XenSource XAPI ............................. SUCCESS [5.546s]
[INFO] Apache CloudStack Plugin POM ...................... SUCCESS [1.094s]
[INFO] Apache CloudStack Plugin - API Rate Limit ......... SUCCESS [6.708s]
[INFO] Apache CloudStack Plugin - API Discovery .......... SUCCESS [4.345s]
[INFO] Apache CloudStack Plugin - ACL Static Role Based .. SUCCESS [3.215s]
[INFO] Apache CloudStack Plugin - User Concentrated Pod Deployment Planner  SUCCESS [3.168s]
[INFO] Apache CloudStack Plugin - User Dispersing Deployment Planner  SUCCESS [2.817s]
[INFO] Apache CloudStack Plugin - Host Allocator Random .. SUCCESS [2.782s]
[INFO] Apache CloudStack Plugin - Hypervisor OracleVM .... SUCCESS [3.671s]
[INFO] Apache CloudStack Cloud Engine Internal Components API  SUCCESS [3.100s]
[INFO] Apache CloudStack Engine Storage Component ........ SUCCESS [3.959s]
[INFO] Apache CloudStack Plugin - Open vSwitch ........... SUCCESS [3.994s]
[INFO] Apache CloudStack Plugin - Hypervisor Xen ......... SUCCESS [4.896s]
[INFO] Apache CloudStack Plugin - Hypervisor KVM ......... SUCCESS [5.524s]
[INFO] Apache CloudStack Plugin - RabbitMQ Event Bus ..... SUCCESS [4.086s]
[INFO] Apache CloudStack Plugin - Hypervisor Simulator ... SUCCESS [4.085s]
[INFO] Apache CloudStack Plugin - Network Elastic Load Balancer  SUCCESS [3.602s]
[INFO] Apache CloudStack Plugin - Network Nicira NVP ..... SUCCESS [6.701s]
[INFO] Apache CloudStack Plugin - BigSwitch Virtual Network Segment  SUCCESS [5.290s]
[INFO] Apache CloudStack Plugin - Storage Allocator Random  SUCCESS [3.262s]
[INFO] Apache CloudStack Plugin - User Authenticator LDAP  SUCCESS [3.544s]
[INFO] Apache CloudStack Plugin - User Authenticator MD5 . SUCCESS [3.366s]
[INFO] Apache CloudStack Plugin - User Authenticator Plain Text  SUCCESS [2.717s]
[INFO] Apache CloudStack Plugin - User Authenticator SHA256 Salted  SUCCESS [4.265s]
[INFO] Apache CloudStack Plugin - Dns Notifier Example ... SUCCESS [2.941s]
[INFO] Apache CloudStack Engine Storage Image Component .. SUCCESS [3.022s]
[INFO] Apache CloudStack Plugin - Storage Image S3 ....... SUCCESS [2.028s]
[INFO] Apache CloudStack Engine Storage Volume Component . SUCCESS [4.202s]
[INFO] Apache CloudStack Plugin - Storage Volume solidfire  SUCCESS [3.881s]
[INFO] Apache CloudStack Cloud Engine Compute Component .. SUCCESS [2.933s]
[INFO] Apache CloudStack Cloud Engine API ................ SUCCESS [3.001s]
[INFO] Apache CloudStack Cloud Engine Orchestration Component  SUCCESS [4.640s]
[INFO] Apache CloudStack Cloud Engine Schema Component ... SUCCESS [3.026s]
[INFO] Apache CloudStack Engine Storage Backup Component . SUCCESS [3.189s]
[INFO] Apache CloudStack Engine Storage Image Motion Component  SUCCESS [3.538s]
[INFO] Apache CloudStack Engine Storage Snapshot Component  SUCCESS [3.145s]
[INFO] Apache CloudStack Client UI ....................... SUCCESS [14.277s]
[INFO] Apache CloudStack Test ............................ SUCCESS [6.576s]
[INFO] Apache CloudStack Engine Storage integration test Component  SUCCESS [4.677s]
[INFO] Apache CloudStack Cloud Engine Service ............ SUCCESS [7.918s]
[INFO] ------------------------------------------------------------------------
[INFO] BUILD SUCCESS
[INFO] ------------------------------------------------------------------------
[INFO] Total time: 5:19.404s
[INFO] Finished at: Mon Jun 17 19:10:16 UTC 2013
[INFO] Final Memory: 39M/169M
[INFO] ------------------------------------------------------------------------
[JENKINS] Archiving disabled
[JENKINS] Archiving disabled
[JENKINS] Archiving disabled
[JENKINS] Archiving disabled
[JENKINS] Archiving disabled
[JENKINS] Archiving disabled
[JENKINS] Archiving disabled
[JENKINS] Archiving disabled
[JENKINS] Archiving disabled
[JENKINS] Archiving disabled
[JENKINS] Archiving disabled
[JENKINS] Archiving disabled
[JENKINS] Archiving disabled
[JENKINS] Archiving disabled
[JENKINS] Archiving disabled
[JENKINS] Archiving disabled
[JENKINS] Archiving disabled
[JENKINS] Archiving disabled
[JENKINS] Archiving disabled
[JENKINS] Archiving disabled
[JENKINS] Archiving disabled
[JENKINS] Archiving disabled
[JENKINS] Archiving disabled
[JENKINS] Archiving disabled
[JENKINS] Archiving disabled
[JENKINS] Archiving disabled
[JENKINS] Archiving disabled
[JENKINS] Archiving disabled
[JENKINS] Archiving disabled
[JENKINS] Archiving disabled
[JENKINS] Archiving disabled
[JENKINS] Archiving disabled
[JENKINS] Archiving disabled
[JENKINS] Archiving disabled
[JENKINS] Archiving disabled
[JENKINS] Archiving disabled
[JENKINS] Archiving disabled
[JENKINS] Archiving disabled
[JENKINS] Archiving disabled
[JENKINS] Archiving disabled
[JENKINS] Archiving disabled
[JENKINS] Archiving disabled
[JENKINS] Archiving disabled
[JENKINS] Archiving disabled
[JENKINS] Archiving disabled
[JENKINS] Archiving disabled
[JENKINS] Archiving disabled
[JENKINS] Archiving disabled
[JENKINS] Archiving disabled
[JENKINS] Archiving disabled
[JENKINS] Archiving disabled
[JENKINS] Archiving disabled
[JENKINS] Archiving disabled
[JENKINS] Archiving disabled
[JENKINS] Archiving disabled
Waiting for Jenkins to finish collecting data
channel stopped
[cloudstack-marvin-41] $ /bin/bash -xe /tmp/hudson211772997653368550.sh
+ mvn -P developer -pl :cloud-apidoc -pl :cloud-marvin
[INFO] Scanning for projects...
[INFO] ------------------------------------------------------------------------
[INFO] Reactor Build Order:
[INFO] 
[INFO] Apache CloudStack apidoc Tools
[INFO] Apache CloudStack Developer Tools: marvin
[INFO]                                                                         
[INFO] ------------------------------------------------------------------------
[INFO] Building Apache CloudStack apidoc Tools 4.1.1-SNAPSHOT
[INFO] ------------------------------------------------------------------------
Downloading: http://repository.apache.org/snapshots/org/apache/cloudstack/cloud-client-ui/4.1.1-SNAPSHOT/maven-metadata.xml

Downloading: http://repository.apache.org/snapshots/org/apache/cloudstack/cloud-client-ui/4.1.1-SNAPSHOT/cloud-client-ui-4.1.1-SNAPSHOT.war

[INFO] ------------------------------------------------------------------------
[INFO] Reactor Summary:
[INFO] 
[INFO] Apache CloudStack apidoc Tools .................... FAILURE [1.475s]
[INFO] Apache CloudStack Developer Tools: marvin ......... SKIPPED
[INFO] ------------------------------------------------------------------------
[INFO] BUILD FAILURE
[INFO] ------------------------------------------------------------------------
[INFO] Total time: 2.799s
[INFO] Finished at: Mon Jun 17 19:10:48 UTC 2013
[INFO] Final Memory: 12M/114M
[INFO] ------------------------------------------------------------------------
[ERROR] Failed to execute goal on project cloud-apidoc: Could not resolve dependencies for
project org.apache.cloudstack:cloud-apidoc:pom:4.1.1-SNAPSHOT: Could not find artifact org.apache.cloudstack:cloud-client-ui:war:4.1.1-SNAPSHOT
in Nexus (http://repository.apache.org/snapshots) -> [Help 1]
[ERROR] 
[ERROR] To see the full stack trace of the errors, re-run Maven with the -e switch.
[ERROR] Re-run Maven using the -X switch to enable full debug logging.
[ERROR] 
[ERROR] For more information about the errors and possible solutions, please read the following
articles:
[ERROR] [Help 1] http://cwiki.apache.org/confluence/display/MAVEN/DependencyResolutionException
Build step 'Execute shell' marked build as failure
Archiving artifacts

Mime
View raw message