cloudstack-commits mailing list archives

Site index · List index
Message view « Date » · « Thread »
Top « Date » · « Thread »
From Apache Jenkins Server <jenk...@builds.apache.org>
Subject Build failed in Jenkins: cloudstack-marvin-41 #449
Date Sat, 22 Jun 2013 16:05:15 GMT
See <https://builds.apache.org/job/cloudstack-marvin-41/449/>

------------------------------------------
[...truncated 3071 lines...]
[INFO] --- maven-clean-plugin:2.5:clean (default-clean) @ cloud-engine-storage-integration-test
---
[INFO] 
[INFO] --- maven-remote-resources-plugin:1.3:process (default) @ cloud-engine-storage-integration-test
---
[INFO] [debug] execute contextualize
[INFO] Using 'UTF-8' encoding to copy filtered resources.
[INFO] skip non existing resourceDirectory <https://builds.apache.org/job/cloudstack-marvin-41/ws/engine/storage/integration-test/src/main/resources>
[INFO] Copying 3 resources

[INFO] --- maven-resources-plugin:2.5:resources (default-resources) @ cloud-engine-storage-integration-test
---
[INFO] No sources to compile
[INFO] 
[INFO] --- maven-compiler-plugin:2.5.1:compile (default-compile) @ cloud-engine-storage-integration-test
---
[INFO] [debug] execute contextualize
[INFO] Using 'UTF-8' encoding to copy filtered resources.
[INFO] Copying 2 resources
[INFO] Copying 3 resources

[INFO] --- maven-resources-plugin:2.5:testResources (default-testResources) @ cloud-engine-storage-integration-test
---
[INFO] [INFO] Compiling 18 source files to <https://builds.apache.org/job/cloudstack-marvin-41/ws/engine/storage/integration-test/target/test-classes>

[INFO] --- maven-compiler-plugin:2.5.1:testCompile (default-testCompile) @ cloud-engine-storage-integration-test
---
[INFO] [INFO] Nothing to compile - all classes are up to date

[INFO] --- maven-compiler-plugin:2.5.1:testCompile (default) @ cloud-engine-storage-integration-test
---
[INFO] [INFO] Tests are skipped.

[INFO] --- maven-surefire-plugin:2.12:test (default-test) @ cloud-engine-storage-integration-test
---
[INFO] [INFO] Building jar: <https://builds.apache.org/job/cloudstack-marvin-41/ws/engine/storage/integration-test/target/cloud-engine-storage-integration-test-4.1.1-SNAPSHOT.jar>

[INFO] --- maven-jar-plugin:2.4:jar (default-jar) @ cloud-engine-storage-integration-test
---
[INFO] 
[INFO] --- maven-site-plugin:3.1:attach-descriptor (attach-descriptor) @ cloud-engine-storage-integration-test
---
[INFO] [INFO] Tests are skipped.

[INFO] --- maven-surefire-plugin:2.12:test (default) @ cloud-engine-storage-integration-test
---
[INFO] [INFO] Installing <https://builds.apache.org/job/cloudstack-marvin-41/ws/engine/storage/integration-test/target/cloud-engine-storage-integration-test-4.1.1-SNAPSHOT.jar>
to /home/jenkins/jenkins-slave/maven-repositories/0/org/apache/cloudstack/cloud-engine-storage-integration-test/4.1.1-SNAPSHOT/cloud-engine-storage-integration-test-4.1.1-SNAPSHOT.jar

[INFO] --- maven-install-plugin:2.3.1:install (default-install) @ cloud-engine-storage-integration-test
---
[INFO] Installing <https://builds.apache.org/job/cloudstack-marvin-41/ws/engine/storage/integration-test/pom.xml>
to /home/jenkins/jenkins-slave/maven-repositories/0/org/apache/cloudstack/cloud-engine-storage-integration-test/4.1.1-SNAPSHOT/cloud-engine-storage-integration-test-4.1.1-SNAPSHOT.pom
[INFO]                                                                         
[INFO] ------------------------------------------------------------------------
[INFO] Building Apache CloudStack Cloud Engine Service 4.1.1-SNAPSHOT
[INFO] ------------------------------------------------------------------------
[INFO] Deleting <https://builds.apache.org/job/cloudstack-marvin-41/ws/engine/service/target>
[INFO] 
[INFO] --- maven-clean-plugin:2.5:clean (default-clean) @ cloud-engine-service ---
[INFO] 
[INFO] --- maven-remote-resources-plugin:1.3:process (default) @ cloud-engine-service ---
[INFO] [debug] execute contextualize
[INFO] Using 'UTF-8' encoding to copy filtered resources.
[INFO] skip non existing resourceDirectory <https://builds.apache.org/job/cloudstack-marvin-41/ws/engine/service/src/main/resources>
[INFO] Copying 3 resources

[INFO] --- maven-resources-plugin:2.5:resources (default-resources) @ cloud-engine-service
---
[INFO] [INFO] Nothing to compile - all classes are up to date

[INFO] --- maven-compiler-plugin:2.5.1:compile (default-compile) @ cloud-engine-service ---
[debug] execute contextualize
[INFO] [INFO] Using 'UTF-8' encoding to copy filtered resources.
[INFO] skip non existing resourceDirectory <https://builds.apache.org/job/cloudstack-marvin-41/ws/engine/service/src/test/resources>
[INFO] Copying 3 resources

[INFO] --- maven-resources-plugin:2.5:testResources (default-testResources) @ cloud-engine-service
---
[INFO] [INFO] No sources to compile

[INFO] --- maven-compiler-plugin:2.5.1:testCompile (default-testCompile) @ cloud-engine-service
---
[INFO] [INFO] Surefire report directory: <https://builds.apache.org/job/cloudstack-marvin-41/ws/engine/service/target/surefire-reports>


-------------------------------------------------------
[INFO] --- maven-surefire-plugin:2.12:test (default-test) @ cloud-engine-service ---
 T E S T S
-------------------------------------------------------

Results :

Tests run: 0, Failures: 0, Errors: 0, Skipped: 0

[JENKINS] Recording test results
[INFO] 
[INFO] --- maven-war-plugin:2.1.1:war (default-war) @ cloud-engine-service ---
[INFO] Packaging webapp
[INFO] Assembling webapp [cloud-engine-service] in [<https://builds.apache.org/job/cloudstack-marvin-41/ws/engine/service/target/engine]>
[INFO] Processing war project
[INFO] Copying webapp resources [<https://builds.apache.org/job/cloudstack-marvin-41/ws/engine/service/src/main/webapp]>
[INFO] Webapp assembled in [1062 msecs]
[INFO] Building war: <https://builds.apache.org/job/cloudstack-marvin-41/ws/engine/service/target/engine.war>
[INFO] WEB-INF/web.xml already added, skipping
[INFO] 
[INFO] --- maven-site-plugin:3.1:attach-descriptor (attach-descriptor) @ cloud-engine-service
---
[INFO] [INFO] Installing <https://builds.apache.org/job/cloudstack-marvin-41/ws/engine/service/target/engine.war>
to /home/jenkins/jenkins-slave/maven-repositories/0/org/apache/cloudstack/cloud-engine-service/4.1.1-SNAPSHOT/cloud-engine-service-4.1.1-SNAPSHOT.war

[INFO] --- maven-install-plugin:2.3.1:install (default-install) @ cloud-engine-service ---
[INFO] Installing <https://builds.apache.org/job/cloudstack-marvin-41/ws/engine/service/pom.xml>
to /home/jenkins/jenkins-slave/maven-repositories/0/org/apache/cloudstack/cloud-engine-service/4.1.1-SNAPSHOT/cloud-engine-service-4.1.1-SNAPSHOT.pom
[INFO] ------------------------------------------------------------------------
[INFO] Reactor Summary:
[INFO] 
[INFO] Apache CloudStack ................................. SUCCESS [18.361s]
[INFO] Apache CloudStack Utils ........................... SUCCESS [25.227s]
[INFO] Apache CloudStack API ............................. SUCCESS [10.125s]
[INFO] Apache CloudStack Core ............................ SUCCESS [5.852s]
[INFO] Apache CloudStack Agents .......................... SUCCESS [6.308s]
[INFO] Apache CloudStack SystemVM Patches ................ SUCCESS [1.373s]
[INFO] Apache CloudStack Console Proxy ................... SUCCESS [9.293s]
[INFO] Apache CloudStack Framework ....................... SUCCESS [0.836s]
[INFO] Apache CloudStack Framework - IPC ................. SUCCESS [5.822s]
[INFO] Apache CloudStack Framework - REST ................ SUCCESS [5.348s]
[INFO] Apache CloudStack Cloud Engine .................... SUCCESS [1.757s]
[INFO] Apache CloudStack Cloud Engine API ................ SUCCESS [4.065s]
[INFO] Apache CloudStack Framework - Event Notification .. SUCCESS [2.905s]
[INFO] Apache CloudStack Server .......................... SUCCESS [20.244s]
[INFO] Apache CloudStack Usage Server .................... SUCCESS [5.287s]
[INFO] Apache XenSource XAPI ............................. SUCCESS [3.797s]
[INFO] Apache CloudStack Plugin POM ...................... SUCCESS [0.833s]
[INFO] Apache CloudStack Plugin - API Rate Limit ......... SUCCESS [6.023s]
[INFO] Apache CloudStack Plugin - API Discovery .......... SUCCESS [4.372s]
[INFO] Apache CloudStack Plugin - ACL Static Role Based .. SUCCESS [3.003s]
[INFO] Apache CloudStack Plugin - User Concentrated Pod Deployment Planner  SUCCESS [2.647s]
[INFO] Apache CloudStack Plugin - User Dispersing Deployment Planner  SUCCESS [5.998s]
[INFO] Apache CloudStack Plugin - Host Allocator Random .. SUCCESS [6.814s]
[INFO] Apache CloudStack Plugin - Hypervisor OracleVM .... SUCCESS [4.156s]
[INFO] Apache CloudStack Cloud Engine Internal Components API  SUCCESS [3.415s]
[INFO] Apache CloudStack Engine Storage Component ........ SUCCESS [4.548s]
[INFO] Apache CloudStack Plugin - Open vSwitch ........... SUCCESS [4.292s]
[INFO] Apache CloudStack Plugin - Hypervisor Xen ......... SUCCESS [5.188s]
[INFO] Apache CloudStack Plugin - Hypervisor KVM ......... SUCCESS [11.081s]
[INFO] Apache CloudStack Plugin - RabbitMQ Event Bus ..... SUCCESS [4.088s]
[INFO] Apache CloudStack Plugin - Hypervisor Simulator ... SUCCESS [6.180s]
[INFO] Apache CloudStack Plugin - Network Elastic Load Balancer  SUCCESS [4.045s]
[INFO] Apache CloudStack Plugin - Network Nicira NVP ..... SUCCESS [7.511s]
[INFO] Apache CloudStack Plugin - BigSwitch Virtual Network Segment  SUCCESS [5.896s]
[INFO] Apache CloudStack Plugin - Storage Allocator Random  SUCCESS [4.071s]
[INFO] Apache CloudStack Plugin - User Authenticator LDAP  SUCCESS [3.760s]
[INFO] Apache CloudStack Plugin - User Authenticator MD5 . SUCCESS [5.683s]
[INFO] Apache CloudStack Plugin - User Authenticator Plain Text  SUCCESS [3.148s]
[INFO] Apache CloudStack Plugin - User Authenticator SHA256 Salted  SUCCESS [4.669s]
[INFO] Apache CloudStack Plugin - Dns Notifier Example ... SUCCESS [3.766s]
[INFO] Apache CloudStack Engine Storage Image Component .. SUCCESS [3.736s]
[INFO] Apache CloudStack Plugin - Storage Image S3 ....... SUCCESS [2.251s]
[INFO] Apache CloudStack Engine Storage Volume Component . SUCCESS [6.007s]
[INFO] Apache CloudStack Plugin - Storage Volume solidfire  SUCCESS [7.209s]
[INFO] Apache CloudStack Cloud Engine Compute Component .. SUCCESS [3.809s]
[INFO] Apache CloudStack Cloud Engine API ................ SUCCESS [3.048s]
[INFO] Apache CloudStack Cloud Engine Orchestration Component  SUCCESS [5.072s]
[INFO] Apache CloudStack Cloud Engine Schema Component ... SUCCESS [2.065s]
[INFO] Apache CloudStack Engine Storage Backup Component . SUCCESS [3.532s]
[INFO] Apache CloudStack Engine Storage Image Motion Component  SUCCESS [3.465s]
[INFO] Apache CloudStack Engine Storage Snapshot Component  SUCCESS [4.355s]
[INFO] Apache CloudStack Client UI ....................... SUCCESS [19.642s]
[INFO] Apache CloudStack Test ............................ SUCCESS [12.120s]
[INFO] Apache CloudStack Engine Storage integration test Component  SUCCESS [4.537s]
[INFO] Apache CloudStack Cloud Engine Service ............ SUCCESS [10.125s]
[INFO] ------------------------------------------------------------------------
[INFO] BUILD SUCCESS
[INFO] ------------------------------------------------------------------------
[INFO] Total time: 5:50.157s
[INFO] Finished at: Sat Jun 22 16:04:33 UTC 2013
[INFO] Final Memory: 38M/141M
[INFO] ------------------------------------------------------------------------
[JENKINS] Archiving disabled
[JENKINS] Archiving disabled
[JENKINS] Archiving disabled
[JENKINS] Archiving disabled
[JENKINS] Archiving disabled
[JENKINS] Archiving disabled
[JENKINS] Archiving disabled
[JENKINS] Archiving disabled
[JENKINS] Archiving disabled
[JENKINS] Archiving disabled
[JENKINS] Archiving disabled
[JENKINS] Archiving disabled
[JENKINS] Archiving disabled
[JENKINS] Archiving disabled
[JENKINS] Archiving disabled
[JENKINS] Archiving disabled
[JENKINS] Archiving disabled
[JENKINS] Archiving disabled
[JENKINS] Archiving disabled
[JENKINS] Archiving disabled
[JENKINS] Archiving disabled
[JENKINS] Archiving disabled
[JENKINS] Archiving disabled
[JENKINS] Archiving disabled
[JENKINS] Archiving disabled
[JENKINS] Archiving disabled
[JENKINS] Archiving disabled
[JENKINS] Archiving disabled
[JENKINS] Archiving disabled
[JENKINS] Archiving disabled
[JENKINS] Archiving disabled
[JENKINS] Archiving disabled
[JENKINS] Archiving disabled
[JENKINS] Archiving disabled
[JENKINS] Archiving disabled
[JENKINS] Archiving disabled
[JENKINS] Archiving disabled
[JENKINS] Archiving disabled
[JENKINS] Archiving disabled
[JENKINS] Archiving disabled
[JENKINS] Archiving disabled
[JENKINS] Archiving disabled
[JENKINS] Archiving disabled
[JENKINS] Archiving disabled
[JENKINS] Archiving disabled
[JENKINS] Archiving disabled
[JENKINS] Archiving disabled
[JENKINS] Archiving disabled
[JENKINS] Archiving disabled
[JENKINS] Archiving disabled
[JENKINS] Archiving disabled
[JENKINS] Archiving disabled
[JENKINS] Archiving disabled
[JENKINS] Archiving disabled
[JENKINS] Archiving disabled
Waiting for Jenkins to finish collecting data
channel stopped
[cloudstack-marvin-41] $ /bin/bash -xe /tmp/hudson4466515209229342155.sh
+ mvn -P developer -pl :cloud-apidoc -pl :cloud-marvin
[INFO] Scanning for projects...
[INFO] ------------------------------------------------------------------------
[INFO] Reactor Build Order:
[INFO] 
[INFO] Apache CloudStack apidoc Tools
[INFO] Apache CloudStack Developer Tools: marvin
[INFO]                                                                         
[INFO] ------------------------------------------------------------------------
[INFO] Building Apache CloudStack apidoc Tools 4.1.1-SNAPSHOT
[INFO] ------------------------------------------------------------------------
[INFO] ------------------------------------------------------------------------
[INFO] Reactor Summary:
[INFO] 
[INFO] Apache CloudStack apidoc Tools .................... FAILURE [2.648s]
[INFO] Apache CloudStack Developer Tools: marvin ......... SKIPPED
[INFO] ------------------------------------------------------------------------
[INFO] BUILD FAILURE
[INFO] ------------------------------------------------------------------------
[INFO] Total time: 4.148s
[INFO] Finished at: Sat Jun 22 16:05:12 UTC 2013
[INFO] Final Memory: 11M/79M
[INFO] ------------------------------------------------------------------------
[ERROR] Failed to execute goal on project cloud-apidoc: Could not resolve dependencies for
project org.apache.cloudstack:cloud-apidoc:pom:4.1.1-SNAPSHOT: Failure to find org.apache.cloudstack:cloud-client-ui:war:4.1.1-SNAPSHOT
in http://repository.apache.org/snapshots was cached in the local repository, resolution will
not be reattempted until the update interval of Nexus has elapsed or updates are forced ->
[Help 1]
[ERROR] 
[ERROR] To see the full stack trace of the errors, re-run Maven with the -e switch.
[ERROR] Re-run Maven using the -X switch to enable full debug logging.
[ERROR] 
[ERROR] For more information about the errors and possible solutions, please read the following
articles:
[ERROR] [Help 1] http://cwiki.apache.org/confluence/display/MAVEN/DependencyResolutionException
Build step 'Execute shell' marked build as failure
Archiving artifacts

Mime
View raw message