cloudstack-commits mailing list archives

Site index · List index
Message view « Date » · « Thread »
Top « Date » · « Thread »
From Apache Jenkins Server <jenk...@builds.apache.org>
Subject Build failed in Jenkins: cloudstack-marvin-41 #476
Date Wed, 26 Jun 2013 04:54:06 GMT
See <https://builds.apache.org/job/cloudstack-marvin-41/476/>

------------------------------------------
[...truncated 3075 lines...]
[INFO] [INFO] Using 'UTF-8' encoding to copy filtered resources.
[INFO] skip non existing resourceDirectory <https://builds.apache.org/job/cloudstack-marvin-41/ws/engine/storage/integration-test/src/main/resources>
[INFO] Copying 3 resources

[INFO] --- maven-resources-plugin:2.5:resources (default-resources) @ cloud-engine-storage-integration-test
---
[INFO] [INFO] No sources to compile

[INFO] --- maven-compiler-plugin:2.5.1:compile (default-compile) @ cloud-engine-storage-integration-test
---
[INFO] [debug] execute contextualize
[INFO] Using 'UTF-8' encoding to copy filtered resources.
[INFO] Copying 2 resources
[INFO] Copying 3 resources

[INFO] --- maven-resources-plugin:2.5:testResources (default-testResources) @ cloud-engine-storage-integration-test
---
[INFO] [INFO] Compiling 18 source files to <https://builds.apache.org/job/cloudstack-marvin-41/ws/engine/storage/integration-test/target/test-classes>

[INFO] --- maven-compiler-plugin:2.5.1:testCompile (default-testCompile) @ cloud-engine-storage-integration-test
---
[INFO] Nothing to compile - all classes are up to date
[INFO] 
[INFO] --- maven-compiler-plugin:2.5.1:testCompile (default) @ cloud-engine-storage-integration-test
---
[INFO] [INFO] Tests are skipped.

[INFO] --- maven-surefire-plugin:2.12:test (default-test) @ cloud-engine-storage-integration-test
---
[INFO] [INFO] Building jar: <https://builds.apache.org/job/cloudstack-marvin-41/ws/engine/storage/integration-test/target/cloud-engine-storage-integration-test-4.1.1-SNAPSHOT.jar>

[INFO] --- maven-jar-plugin:2.4:jar (default-jar) @ cloud-engine-storage-integration-test
---
[INFO] 
[INFO] --- maven-site-plugin:3.1:attach-descriptor (attach-descriptor) @ cloud-engine-storage-integration-test
---
[INFO] [INFO] Tests are skipped.

[INFO] --- maven-surefire-plugin:2.12:test (default) @ cloud-engine-storage-integration-test
---
[INFO] Installing <https://builds.apache.org/job/cloudstack-marvin-41/ws/engine/storage/integration-test/target/cloud-engine-storage-integration-test-4.1.1-SNAPSHOT.jar>
to /home/jenkins/jenkins-slave/maven-repositories/0/org/apache/cloudstack/cloud-engine-storage-integration-test/4.1.1-SNAPSHOT/cloud-engine-storage-integration-test-4.1.1-SNAPSHOT.jar
[INFO] 
[INFO] --- maven-install-plugin:2.3.1:install (default-install) @ cloud-engine-storage-integration-test
---
[INFO] Installing <https://builds.apache.org/job/cloudstack-marvin-41/ws/engine/storage/integration-test/pom.xml>
to /home/jenkins/jenkins-slave/maven-repositories/0/org/apache/cloudstack/cloud-engine-storage-integration-test/4.1.1-SNAPSHOT/cloud-engine-storage-integration-test-4.1.1-SNAPSHOT.pom
[INFO] [INFO] Deleting <https://builds.apache.org/job/cloudstack-marvin-41/ws/engine/service/target>
                                                                        
[INFO] ------------------------------------------------------------------------
[INFO] Building Apache CloudStack Cloud Engine Service 4.1.1-SNAPSHOT
[INFO] ------------------------------------------------------------------------
[INFO] 
[INFO] --- maven-clean-plugin:2.5:clean (default-clean) @ cloud-engine-service ---
[INFO] 
[INFO] --- maven-remote-resources-plugin:1.3:process (default) @ cloud-engine-service ---
[debug] execute contextualize
[INFO] [INFO] Using 'UTF-8' encoding to copy filtered resources.
[INFO] skip non existing resourceDirectory <https://builds.apache.org/job/cloudstack-marvin-41/ws/engine/service/src/main/resources>
[INFO] Copying 3 resources

[INFO] --- maven-resources-plugin:2.5:resources (default-resources) @ cloud-engine-service
---
[INFO] [INFO] Nothing to compile - all classes are up to date

[INFO] --- maven-compiler-plugin:2.5.1:compile (default-compile) @ cloud-engine-service ---
[debug] execute contextualize
[INFO] [INFO] Using 'UTF-8' encoding to copy filtered resources.
[INFO] skip non existing resourceDirectory <https://builds.apache.org/job/cloudstack-marvin-41/ws/engine/service/src/test/resources>
[INFO] Copying 3 resources

[INFO] --- maven-resources-plugin:2.5:testResources (default-testResources) @ cloud-engine-service
---
[INFO] [INFO] No sources to compile

[INFO] --- maven-compiler-plugin:2.5.1:testCompile (default-testCompile) @ cloud-engine-service
---
[INFO] Surefire report directory: <https://builds.apache.org/job/cloudstack-marvin-41/ws/engine/service/target/surefire-reports>
[INFO] 
-------------------------------------------------------
 T E S T S
-------------------------------------------------------

[INFO] --- maven-surefire-plugin:2.12:test (default-test) @ cloud-engine-service ---

Results :

Tests run: 0, Failures: 0, Errors: 0, Skipped: 0

[JENKINS] Recording test results
[INFO] 
[INFO] --- maven-war-plugin:2.1.1:war (default-war) @ cloud-engine-service ---
[INFO] Packaging webapp
[INFO] Assembling webapp [cloud-engine-service] in [<https://builds.apache.org/job/cloudstack-marvin-41/ws/engine/service/target/engine]>
[INFO] Processing war project
[INFO] Copying webapp resources [<https://builds.apache.org/job/cloudstack-marvin-41/ws/engine/service/src/main/webapp]>
[INFO] Webapp assembled in [248 msecs]
[INFO] Building war: <https://builds.apache.org/job/cloudstack-marvin-41/ws/engine/service/target/engine.war>
[INFO] WEB-INF/web.xml already added, skipping
[INFO] 
[INFO] --- maven-site-plugin:3.1:attach-descriptor (attach-descriptor) @ cloud-engine-service
---
[INFO] [INFO] Installing <https://builds.apache.org/job/cloudstack-marvin-41/ws/engine/service/target/engine.war>
to /home/jenkins/jenkins-slave/maven-repositories/0/org/apache/cloudstack/cloud-engine-service/4.1.1-SNAPSHOT/cloud-engine-service-4.1.1-SNAPSHOT.war

[INFO] --- maven-install-plugin:2.3.1:install (default-install) @ cloud-engine-service ---
[INFO] Installing <https://builds.apache.org/job/cloudstack-marvin-41/ws/engine/service/pom.xml>
to /home/jenkins/jenkins-slave/maven-repositories/0/org/apache/cloudstack/cloud-engine-service/4.1.1-SNAPSHOT/cloud-engine-service-4.1.1-SNAPSHOT.pom
[INFO] ------------------------------------------------------------------------
[INFO] Reactor Summary:
[INFO] 
[INFO] Apache CloudStack ................................. SUCCESS [18.982s]
[INFO] Apache CloudStack Utils ........................... SUCCESS [21.440s]
[INFO] Apache CloudStack API ............................. SUCCESS [13.883s]
[INFO] Apache CloudStack Core ............................ SUCCESS [6.149s]
[INFO] Apache CloudStack Agents .......................... SUCCESS [5.761s]
[INFO] Apache CloudStack SystemVM Patches ................ SUCCESS [0.960s]
[INFO] Apache CloudStack Console Proxy ................... SUCCESS [8.785s]
[INFO] Apache CloudStack Framework ....................... SUCCESS [1.217s]
[INFO] Apache CloudStack Framework - IPC ................. SUCCESS [4.170s]
[INFO] Apache CloudStack Framework - REST ................ SUCCESS [3.349s]
[INFO] Apache CloudStack Cloud Engine .................... SUCCESS [0.613s]
[INFO] Apache CloudStack Cloud Engine API ................ SUCCESS [3.295s]
[INFO] Apache CloudStack Framework - Event Notification .. SUCCESS [2.818s]
[INFO] Apache CloudStack Server .......................... SUCCESS [18.430s]
[INFO] Apache CloudStack Usage Server .................... SUCCESS [5.477s]
[INFO] Apache XenSource XAPI ............................. SUCCESS [4.214s]
[INFO] Apache CloudStack Plugin POM ...................... SUCCESS [0.744s]
[INFO] Apache CloudStack Plugin - API Rate Limit ......... SUCCESS [6.321s]
[INFO] Apache CloudStack Plugin - API Discovery .......... SUCCESS [4.478s]
[INFO] Apache CloudStack Plugin - ACL Static Role Based .. SUCCESS [2.968s]
[INFO] Apache CloudStack Plugin - User Concentrated Pod Deployment Planner  SUCCESS [3.055s]
[INFO] Apache CloudStack Plugin - User Dispersing Deployment Planner  SUCCESS [2.872s]
[INFO] Apache CloudStack Plugin - Host Allocator Random .. SUCCESS [2.941s]
[INFO] Apache CloudStack Plugin - Hypervisor OracleVM .... SUCCESS [3.684s]
[INFO] Apache CloudStack Cloud Engine Internal Components API  SUCCESS [2.829s]
[INFO] Apache CloudStack Engine Storage Component ........ SUCCESS [4.208s]
[INFO] Apache CloudStack Plugin - Open vSwitch ........... SUCCESS [3.536s]
[INFO] Apache CloudStack Plugin - Hypervisor Xen ......... SUCCESS [4.980s]
[INFO] Apache CloudStack Plugin - Hypervisor KVM ......... SUCCESS [5.242s]
[INFO] Apache CloudStack Plugin - RabbitMQ Event Bus ..... SUCCESS [3.253s]
[INFO] Apache CloudStack Plugin - Hypervisor Simulator ... SUCCESS [3.873s]
[INFO] Apache CloudStack Plugin - Network Elastic Load Balancer  SUCCESS [3.621s]
[INFO] Apache CloudStack Plugin - Network Nicira NVP ..... SUCCESS [6.749s]
[INFO] Apache CloudStack Plugin - BigSwitch Virtual Network Segment  SUCCESS [5.360s]
[INFO] Apache CloudStack Plugin - Storage Allocator Random  SUCCESS [2.993s]
[INFO] Apache CloudStack Plugin - User Authenticator LDAP  SUCCESS [2.840s]
[INFO] Apache CloudStack Plugin - User Authenticator MD5 . SUCCESS [2.906s]
[INFO] Apache CloudStack Plugin - User Authenticator Plain Text  SUCCESS [3.264s]
[INFO] Apache CloudStack Plugin - User Authenticator SHA256 Salted  SUCCESS [5.432s]
[INFO] Apache CloudStack Plugin - Dns Notifier Example ... SUCCESS [2.949s]
[INFO] Apache CloudStack Engine Storage Image Component .. SUCCESS [2.990s]
[INFO] Apache CloudStack Plugin - Storage Image S3 ....... SUCCESS [2.404s]
[INFO] Apache CloudStack Engine Storage Volume Component . SUCCESS [3.914s]
[INFO] Apache CloudStack Plugin - Storage Volume solidfire  SUCCESS [3.851s]
[INFO] Apache CloudStack Cloud Engine Compute Component .. SUCCESS [2.767s]
[INFO] Apache CloudStack Cloud Engine API ................ SUCCESS [2.766s]
[INFO] Apache CloudStack Cloud Engine Orchestration Component  SUCCESS [4.088s]
[INFO] Apache CloudStack Cloud Engine Schema Component ... SUCCESS [1.984s]
[INFO] Apache CloudStack Engine Storage Backup Component . SUCCESS [2.760s]
[INFO] Apache CloudStack Engine Storage Image Motion Component  SUCCESS [2.713s]
[INFO] Apache CloudStack Engine Storage Snapshot Component  SUCCESS [3.016s]
[INFO] Apache CloudStack Client UI ....................... SUCCESS [11.229s]
[INFO] Apache CloudStack Test ............................ SUCCESS [7.090s]
[INFO] Apache CloudStack Engine Storage integration test Component  SUCCESS [3.945s]
[INFO] Apache CloudStack Cloud Engine Service ............ SUCCESS [7.262s]
[INFO] ------------------------------------------------------------------------
[INFO] BUILD SUCCESS
[INFO] ------------------------------------------------------------------------
[INFO] Total time: 4:43.537s
[INFO] Finished at: Wed Jun 26 04:53:08 UTC 2013
[INFO] Final Memory: 39M/187M
[INFO] ------------------------------------------------------------------------
[JENKINS] Archiving disabled
[JENKINS] Archiving disabled
[JENKINS] Archiving disabled
[JENKINS] Archiving disabled
[JENKINS] Archiving disabled
[JENKINS] Archiving disabled
[JENKINS] Archiving disabled
[JENKINS] Archiving disabled
[JENKINS] Archiving disabled
[JENKINS] Archiving disabled
[JENKINS] Archiving disabled
[JENKINS] Archiving disabled
[JENKINS] Archiving disabled
[JENKINS] Archiving disabled
[JENKINS] Archiving disabled
[JENKINS] Archiving disabled
[JENKINS] Archiving disabled
[JENKINS] Archiving disabled
[JENKINS] Archiving disabled
[JENKINS] Archiving disabled
[JENKINS] Archiving disabled
[JENKINS] Archiving disabled
[JENKINS] Archiving disabled
[JENKINS] Archiving disabled
[JENKINS] Archiving disabled
[JENKINS] Archiving disabled
[JENKINS] Archiving disabled
[JENKINS] Archiving disabled
[JENKINS] Archiving disabled
[JENKINS] Archiving disabled
[JENKINS] Archiving disabled
[JENKINS] Archiving disabled
[JENKINS] Archiving disabled
[JENKINS] Archiving disabled
[JENKINS] Archiving disabled
[JENKINS] Archiving disabled
[JENKINS] Archiving disabled
[JENKINS] Archiving disabled
[JENKINS] Archiving disabled
[JENKINS] Archiving disabled
[JENKINS] Archiving disabled
[JENKINS] Archiving disabled
[JENKINS] Archiving disabled
[JENKINS] Archiving disabled
[JENKINS] Archiving disabled
[JENKINS] Archiving disabled
[JENKINS] Archiving disabled
[JENKINS] Archiving disabled
[JENKINS] Archiving disabled
[JENKINS] Archiving disabled
[JENKINS] Archiving disabled
[JENKINS] Archiving disabled
[JENKINS] Archiving disabled
[JENKINS] Archiving disabled
[JENKINS] Archiving disabled
Waiting for Jenkins to finish collecting data
channel stopped
[cloudstack-marvin-41] $ /bin/bash -xe /tmp/hudson8879108838614885453.sh
+ mvn -P developer -pl :cloud-apidoc -pl :cloud-marvin
[INFO] Scanning for projects...
[INFO] ------------------------------------------------------------------------
[INFO] Reactor Build Order:
[INFO] 
[INFO] Apache CloudStack apidoc Tools
[INFO] Apache CloudStack Developer Tools: marvin
[INFO]                                                                         
[INFO] ------------------------------------------------------------------------
[INFO] Building Apache CloudStack apidoc Tools 4.1.1-SNAPSHOT
[INFO] ------------------------------------------------------------------------
Downloading: http://repository.apache.org/snapshots/org/apache/cloudstack/cloud-client-ui/4.1.1-SNAPSHOT/maven-metadata.xml

Downloading: http://repository.apache.org/snapshots/org/apache/cloudstack/cloud-client-ui/4.1.1-SNAPSHOT/cloud-client-ui-4.1.1-SNAPSHOT.war

[INFO] ------------------------------------------------------------------------
[INFO] Reactor Summary:
[INFO] 
[INFO] Apache CloudStack apidoc Tools .................... FAILURE [0.993s]
[INFO] Apache CloudStack Developer Tools: marvin ......... SKIPPED
[INFO] ------------------------------------------------------------------------
[INFO] BUILD FAILURE
[INFO] ------------------------------------------------------------------------
[INFO] Total time: 2.188s
[INFO] Finished at: Wed Jun 26 04:54:03 UTC 2013
[INFO] Final Memory: 12M/115M
[INFO] ------------------------------------------------------------------------
[ERROR] Failed to execute goal on project cloud-apidoc: Could not resolve dependencies for
project org.apache.cloudstack:cloud-apidoc:pom:4.1.1-SNAPSHOT: Could not find artifact org.apache.cloudstack:cloud-client-ui:war:4.1.1-SNAPSHOT
in Nexus (http://repository.apache.org/snapshots) -> [Help 1]
[ERROR] 
[ERROR] To see the full stack trace of the errors, re-run Maven with the -e switch.
[ERROR] Re-run Maven using the -X switch to enable full debug logging.
[ERROR] 
[ERROR] For more information about the errors and possible solutions, please read the following
articles:
[ERROR] [Help 1] http://cwiki.apache.org/confluence/display/MAVEN/DependencyResolutionException
Build step 'Execute shell' marked build as failure
Archiving artifacts

Mime
View raw message