cloudstack-commits mailing list archives

Site index · List index
Message view « Date » · « Thread »
Top « Date » · « Thread »
From Apache Jenkins Server <jenk...@builds.apache.org>
Subject Build failed in Jenkins: cloudstack-rat-41 #563
Date Fri, 28 Jun 2013 01:34:50 GMT
See <https://builds.apache.org/job/cloudstack-rat-41/563/>

------------------------------------------
Started by an SCM change
Building remotely on ubuntu2 in workspace <https://builds.apache.org/job/cloudstack-rat-41/ws/>
Checkout:cloudstack-rat-41 / <https://builds.apache.org/job/cloudstack-rat-41/ws/> -
hudson.remoting.Channel@205c69ac:ubuntu2
Using strategy: Default
Last Built Revision: Revision 08018803d640b0204d71e99f6c664cb40e483fda (origin/4.1)
hudson.util.IOException2: remote file operation failed: <https://builds.apache.org/job/cloudstack-rat-41/ws/>
at hudson.remoting.Channel@205c69ac:ubuntu2
	at hudson.FilePath.act(FilePath.java:861)
	at hudson.FilePath.act(FilePath.java:838)
	at hudson.plugins.git.GitSCM.determineRevisionToBuild(GitSCM.java:986)
	at hudson.plugins.git.GitSCM.checkout(GitSCM.java:1142)
	at hudson.model.AbstractProject.checkout(AbstractProject.java:1331)
	at hudson.model.AbstractBuild$AbstractBuildExecution.defaultCheckout(AbstractBuild.java:682)
	at jenkins.scm.SCMCheckoutStrategy.checkout(SCMCheckoutStrategy.java:88)
	at hudson.model.AbstractBuild$AbstractBuildExecution.run(AbstractBuild.java:587)
	at hudson.model.Run.execute(Run.java:1568)
	at hudson.model.FreeStyleBuild.run(FreeStyleBuild.java:46)
	at hudson.model.ResourceController.execute(ResourceController.java:88)
	at hudson.model.Executor.run(Executor.java:236)
Caused by: java.io.IOException: Remote call on ubuntu2 failed
	at hudson.remoting.Channel.call(Channel.java:681)
	at hudson.FilePath.act(FilePath.java:854)
	... 11 more
Caused by: java.lang.NoClassDefFoundError: Could not initialize class jenkins.model.Jenkins$MasterComputer
	at hudson.Launcher$LocalLauncher.<init>(Launcher.java:745)
	at hudson.plugins.git.GitAPI.<init>(GitAPI.java:67)
	at hudson.plugins.git.GitSCM$2.invoke(GitSCM.java:994)
	at hudson.plugins.git.GitSCM$2.invoke(GitSCM.java:986)
	at hudson.FilePath$FileCallableWrapper.call(FilePath.java:2348)
	at hudson.remoting.UserRequest.perform(UserRequest.java:118)
	at hudson.remoting.UserRequest.perform(UserRequest.java:48)
	at hudson.remoting.Request$2.run(Request.java:326)
	at hudson.remoting.InterceptingExecutorService$1.call(InterceptingExecutorService.java:72)
	at java.util.concurrent.FutureTask$Sync.innerRun(FutureTask.java:334)
	at java.util.concurrent.FutureTask.run(FutureTask.java:166)
	at java.util.concurrent.ThreadPoolExecutor.runWorker(ThreadPoolExecutor.java:1146)
	at java.util.concurrent.ThreadPoolExecutor$Worker.run(ThreadPoolExecutor.java:615)
	at java.lang.Thread.run(Thread.java:679)
Retrying after 10 seconds
Checkout:cloudstack-rat-41 / <https://builds.apache.org/job/cloudstack-rat-41/ws/> -
hudson.remoting.Channel@205c69ac:ubuntu2
Using strategy: Default
Last Built Revision: Revision 08018803d640b0204d71e99f6c664cb40e483fda (origin/4.1)
hudson.util.IOException2: remote file operation failed: <https://builds.apache.org/job/cloudstack-rat-41/ws/>
at hudson.remoting.Channel@205c69ac:ubuntu2
	at hudson.FilePath.act(FilePath.java:861)
	at hudson.FilePath.act(FilePath.java:838)
	at hudson.plugins.git.GitSCM.determineRevisionToBuild(GitSCM.java:986)
	at hudson.plugins.git.GitSCM.checkout(GitSCM.java:1142)
	at hudson.model.AbstractProject.checkout(AbstractProject.java:1331)
	at hudson.model.AbstractBuild$AbstractBuildExecution.defaultCheckout(AbstractBuild.java:682)
	at jenkins.scm.SCMCheckoutStrategy.checkout(SCMCheckoutStrategy.java:88)
	at hudson.model.AbstractBuild$AbstractBuildExecution.run(AbstractBuild.java:587)
	at hudson.model.Run.execute(Run.java:1568)
	at hudson.model.FreeStyleBuild.run(FreeStyleBuild.java:46)
	at hudson.model.ResourceController.execute(ResourceController.java:88)
	at hudson.model.Executor.run(Executor.java:236)
Caused by: java.io.IOException: Remote call on ubuntu2 failed
	at hudson.remoting.Channel.call(Channel.java:681)
	at hudson.FilePath.act(FilePath.java:854)
	... 11 more
Caused by: java.lang.NoClassDefFoundError: Could not initialize class jenkins.model.Jenkins$MasterComputer
	at hudson.Launcher$LocalLauncher.<init>(Launcher.java:745)
	at hudson.plugins.git.GitAPI.<init>(GitAPI.java:67)
	at hudson.plugins.git.GitSCM$2.invoke(GitSCM.java:994)
	at hudson.plugins.git.GitSCM$2.invoke(GitSCM.java:986)
	at hudson.FilePath$FileCallableWrapper.call(FilePath.java:2348)
	at hudson.remoting.UserRequest.perform(UserRequest.java:118)
	at hudson.remoting.UserRequest.perform(UserRequest.java:48)
	at hudson.remoting.Request$2.run(Request.java:326)
	at hudson.remoting.InterceptingExecutorService$1.call(InterceptingExecutorService.java:72)
	at java.util.concurrent.FutureTask$Sync.innerRun(FutureTask.java:334)
	at java.util.concurrent.FutureTask.run(FutureTask.java:166)
	at java.util.concurrent.ThreadPoolExecutor.runWorker(ThreadPoolExecutor.java:1146)
	at java.util.concurrent.ThreadPoolExecutor$Worker.run(ThreadPoolExecutor.java:615)
	at java.lang.Thread.run(Thread.java:679)
Retrying after 10 seconds
Checkout:cloudstack-rat-41 / <https://builds.apache.org/job/cloudstack-rat-41/ws/> -
hudson.remoting.Channel@205c69ac:ubuntu2
Using strategy: Default
Last Built Revision: Revision 08018803d640b0204d71e99f6c664cb40e483fda (origin/4.1)
hudson.util.IOException2: remote file operation failed: <https://builds.apache.org/job/cloudstack-rat-41/ws/>
at hudson.remoting.Channel@205c69ac:ubuntu2
	at hudson.FilePath.act(FilePath.java:861)
	at hudson.FilePath.act(FilePath.java:838)
	at hudson.plugins.git.GitSCM.determineRevisionToBuild(GitSCM.java:986)
	at hudson.plugins.git.GitSCM.checkout(GitSCM.java:1142)
	at hudson.model.AbstractProject.checkout(AbstractProject.java:1331)
	at hudson.model.AbstractBuild$AbstractBuildExecution.defaultCheckout(AbstractBuild.java:682)
	at jenkins.scm.SCMCheckoutStrategy.checkout(SCMCheckoutStrategy.java:88)
	at hudson.model.AbstractBuild$AbstractBuildExecution.run(AbstractBuild.java:587)
	at hudson.model.Run.execute(Run.java:1568)
	at hudson.model.FreeStyleBuild.run(FreeStyleBuild.java:46)
	at hudson.model.ResourceController.execute(ResourceController.java:88)
	at hudson.model.Executor.run(Executor.java:236)
Caused by: java.io.IOException: Remote call on ubuntu2 failed
	at hudson.remoting.Channel.call(Channel.java:681)
	at hudson.FilePath.act(FilePath.java:854)
	... 11 more
Caused by: java.lang.NoClassDefFoundError: Could not initialize class jenkins.model.Jenkins$MasterComputer
	at hudson.Launcher$LocalLauncher.<init>(Launcher.java:745)
	at hudson.plugins.git.GitAPI.<init>(GitAPI.java:67)
	at hudson.plugins.git.GitSCM$2.invoke(GitSCM.java:994)
	at hudson.plugins.git.GitSCM$2.invoke(GitSCM.java:986)
	at hudson.FilePath$FileCallableWrapper.call(FilePath.java:2348)
	at hudson.remoting.UserRequest.perform(UserRequest.java:118)
	at hudson.remoting.UserRequest.perform(UserRequest.java:48)
	at hudson.remoting.Request$2.run(Request.java:326)
	at hudson.remoting.InterceptingExecutorService$1.call(InterceptingExecutorService.java:72)
	at java.util.concurrent.FutureTask$Sync.innerRun(FutureTask.java:334)
	at java.util.concurrent.FutureTask.run(FutureTask.java:166)
	at java.util.concurrent.ThreadPoolExecutor.runWorker(ThreadPoolExecutor.java:1146)
	at java.util.concurrent.ThreadPoolExecutor$Worker.run(ThreadPoolExecutor.java:615)
	at java.lang.Thread.run(Thread.java:679)
Archiving artifacts
ERROR: Failed to archive artifacts: target/rat.txt
hudson.util.IOException2: java.io.IOException
	at hudson.remoting.FastPipedInputStream.read(FastPipedInputStream.java:175)
	at hudson.util.HeadBufferingStream.read(HeadBufferingStream.java:61)
	at java.io.FilterInputStream.read(FilterInputStream.java:107)
	at hudson.util.HeadBufferingStream.fillSide(HeadBufferingStream.java:83)
	at hudson.FilePath$TarCompression$2.extract(FilePath.java:624)
	at hudson.FilePath.copyRecursiveTo(FilePath.java:1887)
	at hudson.tasks.ArtifactArchiver.perform(ArtifactArchiver.java:116)
	at hudson.tasks.BuildStepMonitor$1.perform(BuildStepMonitor.java:19)
	at hudson.model.AbstractBuild$AbstractBuildExecution.perform(AbstractBuild.java:810)
	at hudson.model.AbstractBuild$AbstractBuildExecution.performAllBuildSteps(AbstractBuild.java:785)
	at hudson.model.Build$BuildExecution.post2(Build.java:183)
	at hudson.model.AbstractBuild$AbstractBuildExecution.post(AbstractBuild.java:732)
	at hudson.model.Run.execute(Run.java:1593)
	at hudson.model.FreeStyleBuild.run(FreeStyleBuild.java:46)
	at hudson.model.ResourceController.execute(ResourceController.java:88)
	at hudson.model.Executor.run(Executor.java:236)

	at hudson.FilePath.copyRecursiveTo(FilePath.java:1894)
	at hudson.tasks.ArtifactArchiver.perform(ArtifactArchiver.java:116)
	at hudson.tasks.BuildStepMonitor$1.perform(BuildStepMonitor.java:19)
	at hudson.model.AbstractBuild$AbstractBuildExecution.perform(AbstractBuild.java:810)
	at hudson.model.AbstractBuild$AbstractBuildExecution.performAllBuildSteps(AbstractBuild.java:785)
	at hudson.model.Build$BuildExecution.post2(Build.java:183)
	at hudson.model.AbstractBuild$AbstractBuildExecution.post(AbstractBuild.java:732)
	at hudson.model.Run.execute(Run.java:1593)
	at hudson.model.FreeStyleBuild.run(FreeStyleBuild.java:46)
	at hudson.model.ResourceController.execute(ResourceController.java:88)
	at hudson.model.Executor.run(Executor.java:236)
Caused by: java.util.concurrent.ExecutionException: hudson.remoting.RequestAbortedException:
java.io.IOException: Unexpected termination of the channel
	at hudson.remoting.Request$1.get(Request.java:278)
	at hudson.remoting.Request$1.get(Request.java:210)
	at hudson.remoting.FutureAdapter.get(FutureAdapter.java:59)
	at hudson.FilePath.copyRecursiveTo(FilePath.java:1890)
	... 10 more
Caused by: hudson.remoting.RequestAbortedException: java.io.IOException: Unexpected termination
of the channel
	at hudson.remoting.Request.abort(Request.java:299)
	at hudson.remoting.Channel.terminate(Channel.java:732)
	at hudson.remoting.SynchronousCommandTransport$ReaderThread.run(SynchronousCommandTransport.java:69)
Caused by: java.io.IOException: Unexpected termination of the channel
	at hudson.remoting.SynchronousCommandTransport$ReaderThread.run(SynchronousCommandTransport.java:50)
Caused by: java.io.EOFException
	at java.io.ObjectInputStream$BlockDataInputStream.peekByte(ObjectInputStream.java:2577)
	at java.io.ObjectInputStream.readObject0(ObjectInputStream.java:1315)
	at java.io.ObjectInputStream.readObject(ObjectInputStream.java:369)
	at hudson.remoting.Command.readFrom(Command.java:92)
	at hudson.remoting.ClassicCommandTransport.read(ClassicCommandTransport.java:59)
	at hudson.remoting.SynchronousCommandTransport$ReaderThread.run(SynchronousCommandTransport.java:48)

Mime
View raw message