cloudstack-commits mailing list archives

Site index · List index
Message view « Date » · « Thread »
Top « Date » · « Thread »
From Apache Jenkins Server <jenk...@builds.apache.org>
Subject Build failed in Jenkins: cloudstack-apidocs-41 #456
Date Sat, 29 Jun 2013 04:26:58 GMT
See <https://builds.apache.org/job/cloudstack-apidocs-41/456/>

------------------------------------------
[...truncated 3067 lines...]
[INFO]                                                                         
[INFO] ------------------------------------------------------------------------
[INFO] Building Apache CloudStack Engine Storage integration test Component 4.1.1-SNAPSHOT
[INFO] ------------------------------------------------------------------------
[INFO] 
[INFO] --- maven-clean-plugin:2.5:clean (default-clean) @ cloud-engine-storage-integration-test
---
[INFO] Deleting <https://builds.apache.org/job/cloudstack-apidocs-41/ws/engine/storage/integration-test/target>
[INFO] 
[INFO] --- maven-remote-resources-plugin:1.3:process (default) @ cloud-engine-storage-integration-test
---
[debug] execute contextualize
[INFO] [INFO] Using 'UTF-8' encoding to copy filtered resources.
[INFO] skip non existing resourceDirectory <https://builds.apache.org/job/cloudstack-apidocs-41/ws/engine/storage/integration-test/src/main/resources>
[INFO] Copying 3 resources

[INFO] --- maven-resources-plugin:2.5:resources (default-resources) @ cloud-engine-storage-integration-test
---
[INFO] [INFO] No sources to compile

[INFO] --- maven-compiler-plugin:2.5.1:compile (default-compile) @ cloud-engine-storage-integration-test
---
[debug] execute contextualize
[INFO] [INFO] Using 'UTF-8' encoding to copy filtered resources.
[INFO] Copying 2 resources

[INFO] --- maven-resources-plugin:2.5:testResources (default-testResources) @ cloud-engine-storage-integration-test
---
[INFO] Copying 3 resources
[INFO] 
[INFO] Compiling 18 source files to <https://builds.apache.org/job/cloudstack-apidocs-41/ws/engine/storage/integration-test/target/test-classes>
[INFO] --- maven-compiler-plugin:2.5.1:testCompile (default-testCompile) @ cloud-engine-storage-integration-test
---
[INFO] [INFO] Nothing to compile - all classes are up to date

[INFO] --- maven-compiler-plugin:2.5.1:testCompile (default) @ cloud-engine-storage-integration-test
---
[INFO] [INFO] Tests are skipped.

[INFO] --- maven-surefire-plugin:2.12:test (default-test) @ cloud-engine-storage-integration-test
---
[INFO] 
[INFO] --- maven-jar-plugin:2.4:jar (default-jar) @ cloud-engine-storage-integration-test
---
[INFO] Building jar: <https://builds.apache.org/job/cloudstack-apidocs-41/ws/engine/storage/integration-test/target/cloud-engine-storage-integration-test-4.1.1-SNAPSHOT.jar>
[INFO] 
[INFO] --- maven-site-plugin:3.1:attach-descriptor (attach-descriptor) @ cloud-engine-storage-integration-test
---
[INFO] [INFO] Tests are skipped.

[INFO] --- maven-surefire-plugin:2.12:test (default) @ cloud-engine-storage-integration-test
---
[INFO] [INFO] Installing <https://builds.apache.org/job/cloudstack-apidocs-41/ws/engine/storage/integration-test/target/cloud-engine-storage-integration-test-4.1.1-SNAPSHOT.jar>
to /home/jenkins/jenkins-slave/maven-repositories/1/org/apache/cloudstack/cloud-engine-storage-integration-test/4.1.1-SNAPSHOT/cloud-engine-storage-integration-test-4.1.1-SNAPSHOT.jar

[INFO] --- maven-install-plugin:2.3.1:install (default-install) @ cloud-engine-storage-integration-test
---
[INFO] Installing <https://builds.apache.org/job/cloudstack-apidocs-41/ws/engine/storage/integration-test/pom.xml>
to /home/jenkins/jenkins-slave/maven-repositories/1/org/apache/cloudstack/cloud-engine-storage-integration-test/4.1.1-SNAPSHOT/cloud-engine-storage-integration-test-4.1.1-SNAPSHOT.pom
[INFO]                                                                         
[INFO] ------------------------------------------------------------------------
[INFO] Building Apache CloudStack Cloud Engine Service 4.1.1-SNAPSHOT
[INFO] ------------------------------------------------------------------------
[INFO] [INFO] Deleting <https://builds.apache.org/job/cloudstack-apidocs-41/ws/engine/service/target>

[INFO] --- maven-clean-plugin:2.5:clean (default-clean) @ cloud-engine-service ---
[INFO] 
[INFO] --- maven-remote-resources-plugin:1.3:process (default) @ cloud-engine-service ---
[debug] execute contextualize
[INFO] [INFO] Using 'UTF-8' encoding to copy filtered resources.
[INFO] skip non existing resourceDirectory <https://builds.apache.org/job/cloudstack-apidocs-41/ws/engine/service/src/main/resources>
[INFO] Copying 3 resources

[INFO] --- maven-resources-plugin:2.5:resources (default-resources) @ cloud-engine-service
---
[INFO] [INFO] Nothing to compile - all classes are up to date

[INFO] --- maven-compiler-plugin:2.5.1:compile (default-compile) @ cloud-engine-service ---
[debug] execute contextualize
[INFO] [INFO] Using 'UTF-8' encoding to copy filtered resources.
[INFO] skip non existing resourceDirectory <https://builds.apache.org/job/cloudstack-apidocs-41/ws/engine/service/src/test/resources>
[INFO] Copying 3 resources

[INFO] --- maven-resources-plugin:2.5:testResources (default-testResources) @ cloud-engine-service
---
[INFO] [INFO] No sources to compile

[INFO] --- maven-compiler-plugin:2.5.1:testCompile (default-testCompile) @ cloud-engine-service
---
[INFO] [INFO] Surefire report directory: <https://builds.apache.org/job/cloudstack-apidocs-41/ws/engine/service/target/surefire-reports>

[INFO] --- maven-surefire-plugin:2.12:test (default-test) @ cloud-engine-service ---

-------------------------------------------------------
 T E S T S
-------------------------------------------------------

Results :

Tests run: 0, Failures: 0, Errors: 0, Skipped: 0

[JENKINS] Recording test results
[INFO] 
[INFO] --- maven-war-plugin:2.1.1:war (default-war) @ cloud-engine-service ---
[INFO] Packaging webapp
[INFO] Assembling webapp [cloud-engine-service] in [<https://builds.apache.org/job/cloudstack-apidocs-41/ws/engine/service/target/engine]>
[INFO] Processing war project
[INFO] Copying webapp resources [<https://builds.apache.org/job/cloudstack-apidocs-41/ws/engine/service/src/main/webapp]>
[INFO] Webapp assembled in [149 msecs]
[INFO] Building war: <https://builds.apache.org/job/cloudstack-apidocs-41/ws/engine/service/target/engine.war>
[INFO] WEB-INF/web.xml already added, skipping
[INFO] 
[INFO] --- maven-site-plugin:3.1:attach-descriptor (attach-descriptor) @ cloud-engine-service
---
[INFO] Installing <https://builds.apache.org/job/cloudstack-apidocs-41/ws/engine/service/target/engine.war>
to /home/jenkins/jenkins-slave/maven-repositories/1/org/apache/cloudstack/cloud-engine-service/4.1.1-SNAPSHOT/cloud-engine-service-4.1.1-SNAPSHOT.war
[INFO] 
[INFO] --- maven-install-plugin:2.3.1:install (default-install) @ cloud-engine-service ---
[INFO] Installing <https://builds.apache.org/job/cloudstack-apidocs-41/ws/engine/service/pom.xml>
to /home/jenkins/jenkins-slave/maven-repositories/1/org/apache/cloudstack/cloud-engine-service/4.1.1-SNAPSHOT/cloud-engine-service-4.1.1-SNAPSHOT.pom
[INFO] ------------------------------------------------------------------------
[INFO] Reactor Summary:
[INFO] 
[INFO] Apache CloudStack ................................. SUCCESS [5.240s]
[INFO] Apache CloudStack Utils ........................... SUCCESS [14.837s]
[INFO] Apache CloudStack API ............................. SUCCESS [8.317s]
[INFO] Apache CloudStack Core ............................ SUCCESS [3.930s]
[INFO] Apache CloudStack Agents .......................... SUCCESS [5.194s]
[INFO] Apache CloudStack SystemVM Patches ................ SUCCESS [0.719s]
[INFO] Apache CloudStack Console Proxy ................... SUCCESS [6.355s]
[INFO] Apache CloudStack Framework ....................... SUCCESS [0.228s]
[INFO] Apache CloudStack Framework - IPC ................. SUCCESS [2.864s]
[INFO] Apache CloudStack Framework - REST ................ SUCCESS [3.200s]
[INFO] Apache CloudStack Cloud Engine .................... SUCCESS [0.224s]
[INFO] Apache CloudStack Cloud Engine API ................ SUCCESS [2.428s]
[INFO] Apache CloudStack Framework - Event Notification .. SUCCESS [2.318s]
[INFO] Apache CloudStack Server .......................... SUCCESS [20.373s]
[INFO] Apache CloudStack Usage Server .................... SUCCESS [4.195s]
[INFO] Apache XenSource XAPI ............................. SUCCESS [3.511s]
[INFO] Apache CloudStack Plugin POM ...................... SUCCESS [0.515s]
[INFO] Apache CloudStack Plugin - API Rate Limit ......... SUCCESS [4.436s]
[INFO] Apache CloudStack Plugin - API Discovery .......... SUCCESS [3.067s]
[INFO] Apache CloudStack Plugin - ACL Static Role Based .. SUCCESS [2.104s]
[INFO] Apache CloudStack Plugin - User Concentrated Pod Deployment Planner  SUCCESS [2.022s]
[INFO] Apache CloudStack Plugin - User Dispersing Deployment Planner  SUCCESS [1.940s]
[INFO] Apache CloudStack Plugin - Host Allocator Random .. SUCCESS [2.155s]
[INFO] Apache CloudStack Plugin - Hypervisor OracleVM .... SUCCESS [2.574s]
[INFO] Apache CloudStack Cloud Engine Internal Components API  SUCCESS [1.897s]
[INFO] Apache CloudStack Engine Storage Component ........ SUCCESS [2.647s]
[INFO] Apache CloudStack Plugin - Open vSwitch ........... SUCCESS [2.306s]
[INFO] Apache CloudStack Plugin - Hypervisor Xen ......... SUCCESS [3.294s]
[INFO] Apache CloudStack Plugin - Hypervisor KVM ......... SUCCESS [3.870s]
[INFO] Apache CloudStack Plugin - RabbitMQ Event Bus ..... SUCCESS [2.132s]
[INFO] Apache CloudStack Plugin - Hypervisor Simulator ... SUCCESS [2.542s]
[INFO] Apache CloudStack Plugin - Network Elastic Load Balancer  SUCCESS [2.283s]
[INFO] Apache CloudStack Plugin - Network Nicira NVP ..... SUCCESS [4.462s]
[INFO] Apache CloudStack Plugin - BigSwitch Virtual Network Segment  SUCCESS [3.787s]
[INFO] Apache CloudStack Plugin - Storage Allocator Random  SUCCESS [2.074s]
[INFO] Apache CloudStack Plugin - User Authenticator LDAP  SUCCESS [1.837s]
[INFO] Apache CloudStack Plugin - User Authenticator MD5 . SUCCESS [2.000s]
[INFO] Apache CloudStack Plugin - User Authenticator Plain Text  SUCCESS [2.107s]
[INFO] Apache CloudStack Plugin - User Authenticator SHA256 Salted  SUCCESS [3.267s]
[INFO] Apache CloudStack Plugin - Dns Notifier Example ... SUCCESS [2.073s]
[INFO] Apache CloudStack Engine Storage Image Component .. SUCCESS [2.172s]
[INFO] Apache CloudStack Plugin - Storage Image S3 ....... SUCCESS [1.409s]
[INFO] Apache CloudStack Engine Storage Volume Component . SUCCESS [2.851s]
[INFO] Apache CloudStack Plugin - Storage Volume solidfire  SUCCESS [2.587s]
[INFO] Apache CloudStack Cloud Engine Compute Component .. SUCCESS [1.868s]
[INFO] Apache CloudStack Cloud Engine API ................ SUCCESS [1.863s]
[INFO] Apache CloudStack Cloud Engine Orchestration Component  SUCCESS [3.232s]
[INFO] Apache CloudStack Cloud Engine Schema Component ... SUCCESS [1.284s]
[INFO] Apache CloudStack Engine Storage Backup Component . SUCCESS [1.945s]
[INFO] Apache CloudStack Engine Storage Image Motion Component  SUCCESS [2.102s]
[INFO] Apache CloudStack Engine Storage Snapshot Component  SUCCESS [2.089s]
[INFO] Apache CloudStack Client UI ....................... SUCCESS [6.718s]
[INFO] Apache CloudStack Test ............................ SUCCESS [3.128s]
[INFO] Apache CloudStack Engine Storage integration test Component  SUCCESS [2.424s]
[INFO] Apache CloudStack Cloud Engine Service ............ SUCCESS [5.082s]
[INFO] ------------------------------------------------------------------------
[INFO] BUILD SUCCESS
[INFO] ------------------------------------------------------------------------
[INFO] Total time: 3:08.361s
[INFO] Finished at: Sat Jun 29 04:26:27 UTC 2013
[INFO] Final Memory: 35M/171M
[INFO] ------------------------------------------------------------------------
[JENKINS] Archiving disabled
[JENKINS] Archiving disabled
[JENKINS] Archiving disabled
[JENKINS] Archiving disabled
[JENKINS] Archiving disabled
[JENKINS] Archiving disabled
[JENKINS] Archiving disabled
[JENKINS] Archiving disabled
[JENKINS] Archiving disabled
[JENKINS] Archiving disabled
[JENKINS] Archiving disabled
[JENKINS] Archiving disabled
[JENKINS] Archiving disabled
[JENKINS] Archiving disabled
[JENKINS] Archiving disabled
[JENKINS] Archiving disabled
[JENKINS] Archiving disabled
[JENKINS] Archiving disabled
[JENKINS] Archiving disabled
[JENKINS] Archiving disabled
[JENKINS] Archiving disabled
[JENKINS] Archiving disabled
[JENKINS] Archiving disabled
[JENKINS] Archiving disabled
[JENKINS] Archiving disabled
[JENKINS] Archiving disabled
[JENKINS] Archiving disabled
[JENKINS] Archiving disabled
[JENKINS] Archiving disabled
[JENKINS] Archiving disabled
[JENKINS] Archiving disabled
[JENKINS] Archiving disabled
[JENKINS] Archiving disabled
[JENKINS] Archiving disabled
[JENKINS] Archiving disabled
[JENKINS] Archiving disabled
[JENKINS] Archiving disabled
[JENKINS] Archiving disabled
[JENKINS] Archiving disabled
[JENKINS] Archiving disabled
[JENKINS] Archiving disabled
[JENKINS] Archiving disabled
[JENKINS] Archiving disabled
[JENKINS] Archiving disabled
[JENKINS] Archiving disabled
[JENKINS] Archiving disabled
[JENKINS] Archiving disabled
[JENKINS] Archiving disabled
[JENKINS] Archiving disabled
[JENKINS] Archiving disabled
[JENKINS] Archiving disabled
[JENKINS] Archiving disabled
[JENKINS] Archiving disabled
[JENKINS] Archiving disabled
[JENKINS] Archiving disabled
Waiting for Jenkins to finish collecting data
channel stopped
[cloudstack-apidocs-41] $ /bin/bash -xe /tmp/hudson8870327530671374698.sh
+ mvn -P developer -pl :cloud-apidoc
[INFO] Scanning for projects...
[INFO]                                                                         
[INFO] ------------------------------------------------------------------------
[INFO] Building Apache CloudStack apidoc Tools 4.1.1-SNAPSHOT
[INFO] ------------------------------------------------------------------------
Downloading: http://repository.apache.org/snapshots/org/apache/cloudstack/cloud-client-ui/4.1.1-SNAPSHOT/maven-metadata.xml

Downloading: http://repository.apache.org/snapshots/org/apache/cloudstack/cloud-client-ui/4.1.1-SNAPSHOT/cloud-client-ui-4.1.1-SNAPSHOT.war

[INFO] ------------------------------------------------------------------------
[INFO] BUILD FAILURE
[INFO] ------------------------------------------------------------------------
[INFO] Total time: 2.363s
[INFO] Finished at: Sat Jun 29 04:26:55 UTC 2013
[INFO] Final Memory: 12M/79M
[INFO] ------------------------------------------------------------------------
[ERROR] Failed to execute goal on project cloud-apidoc: Could not resolve dependencies for
project org.apache.cloudstack:cloud-apidoc:pom:4.1.1-SNAPSHOT: Could not find artifact org.apache.cloudstack:cloud-client-ui:war:4.1.1-SNAPSHOT
in Nexus (http://repository.apache.org/snapshots) -> [Help 1]
[ERROR] 
[ERROR] To see the full stack trace of the errors, re-run Maven with the -e switch.
[ERROR] Re-run Maven using the -X switch to enable full debug logging.
[ERROR] 
[ERROR] For more information about the errors and possible solutions, please read the following
articles:
[ERROR] [Help 1] http://cwiki.apache.org/confluence/display/MAVEN/DependencyResolutionException
Build step 'Execute shell' marked build as failure
Archiving artifacts

Mime
View raw message