cloudstack-commits mailing list archives

Site index · List index
Message view « Date » · « Thread »
Top « Date » · « Thread »
From Apache Jenkins Server <jenk...@builds.apache.org>
Subject Build failed in Jenkins: cloudstack-marvin-41 #471
Date Mon, 24 Jun 2013 23:05:18 GMT
See <https://builds.apache.org/job/cloudstack-marvin-41/471/changes>

Changes:

[geoff.higginbttom] CLOUDSTACK-3098: Fix for CentOS/RHEL

------------------------------------------
[...truncated 3071 lines...]
[INFO] --- maven-clean-plugin:2.5:clean (default-clean) @ cloud-engine-storage-integration-test
---
[INFO] 
[INFO] --- maven-remote-resources-plugin:1.3:process (default) @ cloud-engine-storage-integration-test
---
[INFO] [debug] execute contextualize
[INFO] Using 'UTF-8' encoding to copy filtered resources.
[INFO] skip non existing resourceDirectory <https://builds.apache.org/job/cloudstack-marvin-41/ws/engine/storage/integration-test/src/main/resources>
[INFO] Copying 3 resources

[INFO] --- maven-resources-plugin:2.5:resources (default-resources) @ cloud-engine-storage-integration-test
---
[INFO] [INFO] No sources to compile

[INFO] --- maven-compiler-plugin:2.5.1:compile (default-compile) @ cloud-engine-storage-integration-test
---
[debug] execute contextualize
[INFO] [INFO] Using 'UTF-8' encoding to copy filtered resources.
[INFO] Copying 2 resources

[INFO] --- maven-resources-plugin:2.5:testResources (default-testResources) @ cloud-engine-storage-integration-test
---
[INFO] Copying 3 resources
[INFO] [INFO] Compiling 18 source files to <https://builds.apache.org/job/cloudstack-marvin-41/ws/engine/storage/integration-test/target/test-classes>

[INFO] --- maven-compiler-plugin:2.5.1:testCompile (default-testCompile) @ cloud-engine-storage-integration-test
---
[INFO] [INFO] Nothing to compile - all classes are up to date

[INFO] --- maven-compiler-plugin:2.5.1:testCompile (default) @ cloud-engine-storage-integration-test
---
[INFO] [INFO] Tests are skipped.

[INFO] --- maven-surefire-plugin:2.12:test (default-test) @ cloud-engine-storage-integration-test
---
[INFO] 
[INFO] --- maven-jar-plugin:2.4:jar (default-jar) @ cloud-engine-storage-integration-test
---
[INFO] Building jar: <https://builds.apache.org/job/cloudstack-marvin-41/ws/engine/storage/integration-test/target/cloud-engine-storage-integration-test-4.1.1-SNAPSHOT.jar>
[INFO] 
[INFO] --- maven-site-plugin:3.1:attach-descriptor (attach-descriptor) @ cloud-engine-storage-integration-test
---
[INFO] Tests are skipped.
[INFO] 
[INFO] --- maven-surefire-plugin:2.12:test (default) @ cloud-engine-storage-integration-test
---
[INFO] Installing <https://builds.apache.org/job/cloudstack-marvin-41/ws/engine/storage/integration-test/target/cloud-engine-storage-integration-test-4.1.1-SNAPSHOT.jar>
to /home/jenkins/jenkins-slave/maven-repositories/1/org/apache/cloudstack/cloud-engine-storage-integration-test/4.1.1-SNAPSHOT/cloud-engine-storage-integration-test-4.1.1-SNAPSHOT.jar
[INFO] [INFO] Installing <https://builds.apache.org/job/cloudstack-marvin-41/ws/engine/storage/integration-test/pom.xml>
to /home/jenkins/jenkins-slave/maven-repositories/1/org/apache/cloudstack/cloud-engine-storage-integration-test/4.1.1-SNAPSHOT/cloud-engine-storage-integration-test-4.1.1-SNAPSHOT.pom

[INFO] --- maven-install-plugin:2.3.1:install (default-install) @ cloud-engine-storage-integration-test
---
[INFO] [INFO] Deleting <https://builds.apache.org/job/cloudstack-marvin-41/ws/engine/service/target>
                                                                        
[INFO] ------------------------------------------------------------------------
[INFO] Building Apache CloudStack Cloud Engine Service 4.1.1-SNAPSHOT
[INFO] ------------------------------------------------------------------------
[INFO] 
[INFO] --- maven-clean-plugin:2.5:clean (default-clean) @ cloud-engine-service ---
[INFO] 
[INFO] --- maven-remote-resources-plugin:1.3:process (default) @ cloud-engine-service ---
[debug] execute contextualize
[INFO] Using 'UTF-8' encoding to copy filtered resources.
[INFO] skip non existing resourceDirectory <https://builds.apache.org/job/cloudstack-marvin-41/ws/engine/service/src/main/resources>
[INFO] Copying 3 resources
[INFO] 
[INFO] --- maven-resources-plugin:2.5:resources (default-resources) @ cloud-engine-service
---
[INFO] [INFO] Nothing to compile - all classes are up to date

[INFO] --- maven-compiler-plugin:2.5.1:compile (default-compile) @ cloud-engine-service ---
[debug] execute contextualize
[INFO] [INFO] Using 'UTF-8' encoding to copy filtered resources.
[INFO] skip non existing resourceDirectory <https://builds.apache.org/job/cloudstack-marvin-41/ws/engine/service/src/test/resources>
[INFO] Copying 3 resources

[INFO] --- maven-resources-plugin:2.5:testResources (default-testResources) @ cloud-engine-service
---
[INFO] No sources to compile
[INFO] 
[INFO] --- maven-compiler-plugin:2.5.1:testCompile (default-testCompile) @ cloud-engine-service
---
[INFO] [INFO] Surefire report directory: <https://builds.apache.org/job/cloudstack-marvin-41/ws/engine/service/target/surefire-reports>

-------------------------------------------------------
 T E S T S
-------------------------------------------------------

[INFO] --- maven-surefire-plugin:2.12:test (default-test) @ cloud-engine-service ---

Results :

Tests run: 0, Failures: 0, Errors: 0, Skipped: 0

[JENKINS] Recording test results
[INFO] 
[INFO] --- maven-war-plugin:2.1.1:war (default-war) @ cloud-engine-service ---
[INFO] Packaging webapp
[INFO] Assembling webapp [cloud-engine-service] in [<https://builds.apache.org/job/cloudstack-marvin-41/ws/engine/service/target/engine]>
[INFO] Processing war project
[INFO] Copying webapp resources [<https://builds.apache.org/job/cloudstack-marvin-41/ws/engine/service/src/main/webapp]>
[INFO] Webapp assembled in [357 msecs]
[INFO] Building war: <https://builds.apache.org/job/cloudstack-marvin-41/ws/engine/service/target/engine.war>
[INFO] WEB-INF/web.xml already added, skipping
[INFO] 
[INFO] --- maven-site-plugin:3.1:attach-descriptor (attach-descriptor) @ cloud-engine-service
---
[INFO] Installing <https://builds.apache.org/job/cloudstack-marvin-41/ws/engine/service/target/engine.war>
to /home/jenkins/jenkins-slave/maven-repositories/1/org/apache/cloudstack/cloud-engine-service/4.1.1-SNAPSHOT/cloud-engine-service-4.1.1-SNAPSHOT.war
[INFO] 
[INFO] --- maven-install-plugin:2.3.1:install (default-install) @ cloud-engine-service ---
[INFO] Installing <https://builds.apache.org/job/cloudstack-marvin-41/ws/engine/service/pom.xml>
to /home/jenkins/jenkins-slave/maven-repositories/1/org/apache/cloudstack/cloud-engine-service/4.1.1-SNAPSHOT/cloud-engine-service-4.1.1-SNAPSHOT.pom
[INFO] ------------------------------------------------------------------------
[INFO] Reactor Summary:
[INFO] 
[INFO] Apache CloudStack ................................. SUCCESS [19.154s]
[INFO] Apache CloudStack Utils ........................... SUCCESS [20.212s]
[INFO] Apache CloudStack API ............................. SUCCESS [15.259s]
[INFO] Apache CloudStack Core ............................ SUCCESS [5.407s]
[INFO] Apache CloudStack Agents .......................... SUCCESS [7.135s]
[INFO] Apache CloudStack SystemVM Patches ................ SUCCESS [0.907s]
[INFO] Apache CloudStack Console Proxy ................... SUCCESS [8.961s]
[INFO] Apache CloudStack Framework ....................... SUCCESS [0.591s]
[INFO] Apache CloudStack Framework - IPC ................. SUCCESS [4.152s]
[INFO] Apache CloudStack Framework - REST ................ SUCCESS [3.556s]
[INFO] Apache CloudStack Cloud Engine .................... SUCCESS [0.545s]
[INFO] Apache CloudStack Cloud Engine API ................ SUCCESS [3.164s]
[INFO] Apache CloudStack Framework - Event Notification .. SUCCESS [2.557s]
[INFO] Apache CloudStack Server .......................... SUCCESS [23.244s]
[INFO] Apache CloudStack Usage Server .................... SUCCESS [7.524s]
[INFO] Apache XenSource XAPI ............................. SUCCESS [6.596s]
[INFO] Apache CloudStack Plugin POM ...................... SUCCESS [1.381s]
[INFO] Apache CloudStack Plugin - API Rate Limit ......... SUCCESS [5.846s]
[INFO] Apache CloudStack Plugin - API Discovery .......... SUCCESS [4.836s]
[INFO] Apache CloudStack Plugin - ACL Static Role Based .. SUCCESS [3.289s]
[INFO] Apache CloudStack Plugin - User Concentrated Pod Deployment Planner  SUCCESS [3.149s]
[INFO] Apache CloudStack Plugin - User Dispersing Deployment Planner  SUCCESS [3.142s]
[INFO] Apache CloudStack Plugin - Host Allocator Random .. SUCCESS [3.127s]
[INFO] Apache CloudStack Plugin - Hypervisor OracleVM .... SUCCESS [4.384s]
[INFO] Apache CloudStack Cloud Engine Internal Components API  SUCCESS [3.144s]
[INFO] Apache CloudStack Engine Storage Component ........ SUCCESS [4.699s]
[INFO] Apache CloudStack Plugin - Open vSwitch ........... SUCCESS [3.080s]
[INFO] Apache CloudStack Plugin - Hypervisor Xen ......... SUCCESS [4.277s]
[INFO] Apache CloudStack Plugin - Hypervisor KVM ......... SUCCESS [6.861s]
[INFO] Apache CloudStack Plugin - RabbitMQ Event Bus ..... SUCCESS [4.180s]
[INFO] Apache CloudStack Plugin - Hypervisor Simulator ... SUCCESS [4.293s]
[INFO] Apache CloudStack Plugin - Network Elastic Load Balancer  SUCCESS [3.493s]
[INFO] Apache CloudStack Plugin - Network Nicira NVP ..... SUCCESS [6.636s]
[INFO] Apache CloudStack Plugin - BigSwitch Virtual Network Segment  SUCCESS [5.677s]
[INFO] Apache CloudStack Plugin - Storage Allocator Random  SUCCESS [3.003s]
[INFO] Apache CloudStack Plugin - User Authenticator LDAP  SUCCESS [3.058s]
[INFO] Apache CloudStack Plugin - User Authenticator MD5 . SUCCESS [2.897s]
[INFO] Apache CloudStack Plugin - User Authenticator Plain Text  SUCCESS [2.784s]
[INFO] Apache CloudStack Plugin - User Authenticator SHA256 Salted  SUCCESS [6.465s]
[INFO] Apache CloudStack Plugin - Dns Notifier Example ... SUCCESS [3.081s]
[INFO] Apache CloudStack Engine Storage Image Component .. SUCCESS [2.989s]
[INFO] Apache CloudStack Plugin - Storage Image S3 ....... SUCCESS [2.005s]
[INFO] Apache CloudStack Engine Storage Volume Component . SUCCESS [4.319s]
[INFO] Apache CloudStack Plugin - Storage Volume solidfire  SUCCESS [3.780s]
[INFO] Apache CloudStack Cloud Engine Compute Component .. SUCCESS [2.680s]
[INFO] Apache CloudStack Cloud Engine API ................ SUCCESS [3.091s]
[INFO] Apache CloudStack Cloud Engine Orchestration Component  SUCCESS [5.159s]
[INFO] Apache CloudStack Cloud Engine Schema Component ... SUCCESS [2.422s]
[INFO] Apache CloudStack Engine Storage Backup Component . SUCCESS [3.360s]
[INFO] Apache CloudStack Engine Storage Image Motion Component  SUCCESS [3.240s]
[INFO] Apache CloudStack Engine Storage Snapshot Component  SUCCESS [3.461s]
[INFO] Apache CloudStack Client UI ....................... SUCCESS [12.674s]
[INFO] Apache CloudStack Test ............................ SUCCESS [7.069s]
[INFO] Apache CloudStack Engine Storage integration test Component  SUCCESS [3.797s]
[INFO] Apache CloudStack Cloud Engine Service ............ SUCCESS [8.037s]
[INFO] ------------------------------------------------------------------------
[INFO] BUILD SUCCESS
[INFO] ------------------------------------------------------------------------
[INFO] Total time: 5:05.302s
[INFO] Finished at: Mon Jun 24 23:04:24 UTC 2013
[INFO] Final Memory: 36M/167M
[INFO] ------------------------------------------------------------------------
[JENKINS] Archiving disabled
[JENKINS] Archiving disabled
[JENKINS] Archiving disabled
[JENKINS] Archiving disabled
[JENKINS] Archiving disabled
[JENKINS] Archiving disabled
[JENKINS] Archiving disabled
[JENKINS] Archiving disabled
[JENKINS] Archiving disabled
[JENKINS] Archiving disabled
[JENKINS] Archiving disabled
[JENKINS] Archiving disabled
[JENKINS] Archiving disabled
[JENKINS] Archiving disabled
[JENKINS] Archiving disabled
[JENKINS] Archiving disabled
[JENKINS] Archiving disabled
[JENKINS] Archiving disabled
[JENKINS] Archiving disabled
[JENKINS] Archiving disabled
[JENKINS] Archiving disabled
[JENKINS] Archiving disabled
[JENKINS] Archiving disabled
[JENKINS] Archiving disabled
[JENKINS] Archiving disabled
[JENKINS] Archiving disabled
[JENKINS] Archiving disabled
[JENKINS] Archiving disabled
[JENKINS] Archiving disabled
[JENKINS] Archiving disabled
[JENKINS] Archiving disabled
[JENKINS] Archiving disabled
[JENKINS] Archiving disabled
[JENKINS] Archiving disabled
[JENKINS] Archiving disabled
[JENKINS] Archiving disabled
[JENKINS] Archiving disabled
[JENKINS] Archiving disabled
[JENKINS] Archiving disabled
[JENKINS] Archiving disabled
[JENKINS] Archiving disabled
[JENKINS] Archiving disabled
[JENKINS] Archiving disabled
[JENKINS] Archiving disabled
[JENKINS] Archiving disabled
[JENKINS] Archiving disabled
[JENKINS] Archiving disabled
[JENKINS] Archiving disabled
[JENKINS] Archiving disabled
[JENKINS] Archiving disabled
[JENKINS] Archiving disabled
[JENKINS] Archiving disabled
[JENKINS] Archiving disabled
[JENKINS] Archiving disabled
[JENKINS] Archiving disabled
Waiting for Jenkins to finish collecting data
channel stopped
[cloudstack-marvin-41] $ /bin/bash -xe /tmp/hudson4680204053205129354.sh
+ mvn -P developer -pl :cloud-apidoc -pl :cloud-marvin
[INFO] Scanning for projects...
[INFO] ------------------------------------------------------------------------
[INFO] Reactor Build Order:
[INFO] 
[INFO] Apache CloudStack apidoc Tools
[INFO] Apache CloudStack Developer Tools: marvin
[INFO]                                                                         
[INFO] ------------------------------------------------------------------------
[INFO] Building Apache CloudStack apidoc Tools 4.1.1-SNAPSHOT
[INFO] ------------------------------------------------------------------------
[INFO] ------------------------------------------------------------------------
[INFO] Reactor Summary:
[INFO] 
[INFO] Apache CloudStack apidoc Tools .................... FAILURE [1.079s]
[INFO] Apache CloudStack Developer Tools: marvin ......... SKIPPED
[INFO] ------------------------------------------------------------------------
[INFO] BUILD FAILURE
[INFO] ------------------------------------------------------------------------
[INFO] Total time: 2.289s
[INFO] Finished at: Mon Jun 24 23:05:15 UTC 2013
[INFO] Final Memory: 12M/115M
[INFO] ------------------------------------------------------------------------
[ERROR] Failed to execute goal on project cloud-apidoc: Could not resolve dependencies for
project org.apache.cloudstack:cloud-apidoc:pom:4.1.1-SNAPSHOT: Failure to find org.apache.cloudstack:cloud-client-ui:war:4.1.1-SNAPSHOT
in http://repository.apache.org/snapshots was cached in the local repository, resolution will
not be reattempted until the update interval of Nexus has elapsed or updates are forced ->
[Help 1]
[ERROR] 
[ERROR] To see the full stack trace of the errors, re-run Maven with the -e switch.
[ERROR] Re-run Maven using the -X switch to enable full debug logging.
[ERROR] 
[ERROR] For more information about the errors and possible solutions, please read the following
articles:
[ERROR] [Help 1] http://cwiki.apache.org/confluence/display/MAVEN/DependencyResolutionException
Build step 'Execute shell' marked build as failure
Archiving artifacts

Mime
View raw message