cloudstack-commits mailing list archives

Site index · List index
Message view « Date » · « Thread »
Top « Date » · « Thread »
From Apache Jenkins Server <jenk...@builds.apache.org>
Subject Build failed in Jenkins: cloudstack-apidocs-41 #369
Date Mon, 17 Jun 2013 23:01:09 GMT
See <https://builds.apache.org/job/cloudstack-apidocs-41/369/>

------------------------------------------
[...truncated 3067 lines...]
[INFO] [INFO] Deleting <https://builds.apache.org/job/cloudstack-apidocs-41/ws/engine/storage/integration-test/target>
                                                                        
[INFO] ------------------------------------------------------------------------
[INFO] Building Apache CloudStack Engine Storage integration test Component 4.1.1-SNAPSHOT
[INFO] ------------------------------------------------------------------------
[INFO] 
[INFO] --- maven-clean-plugin:2.5:clean (default-clean) @ cloud-engine-storage-integration-test
---
[INFO] 
[INFO] --- maven-remote-resources-plugin:1.3:process (default) @ cloud-engine-storage-integration-test
---
[debug] execute contextualize
[INFO] [INFO] Using 'UTF-8' encoding to copy filtered resources.
[INFO] skip non existing resourceDirectory <https://builds.apache.org/job/cloudstack-apidocs-41/ws/engine/storage/integration-test/src/main/resources>
[INFO] Copying 3 resources

[INFO] --- maven-resources-plugin:2.5:resources (default-resources) @ cloud-engine-storage-integration-test
---
[INFO] [INFO] No sources to compile

[INFO] --- maven-compiler-plugin:2.5.1:compile (default-compile) @ cloud-engine-storage-integration-test
---
[debug] execute contextualize
[INFO] [INFO] Using 'UTF-8' encoding to copy filtered resources.
[INFO] Copying 2 resources
[INFO] Copying 3 resources

[INFO] --- maven-resources-plugin:2.5:testResources (default-testResources) @ cloud-engine-storage-integration-test
---
[INFO] [INFO] Compiling 18 source files to <https://builds.apache.org/job/cloudstack-apidocs-41/ws/engine/storage/integration-test/target/test-classes>

[INFO] --- maven-compiler-plugin:2.5.1:testCompile (default-testCompile) @ cloud-engine-storage-integration-test
---
[INFO] [INFO] Nothing to compile - all classes are up to date

[INFO] --- maven-compiler-plugin:2.5.1:testCompile (default) @ cloud-engine-storage-integration-test
---
[INFO] Tests are skipped.
[INFO] 
[INFO] --- maven-surefire-plugin:2.12:test (default-test) @ cloud-engine-storage-integration-test
---
[INFO] [INFO] Building jar: <https://builds.apache.org/job/cloudstack-apidocs-41/ws/engine/storage/integration-test/target/cloud-engine-storage-integration-test-4.1.1-SNAPSHOT.jar>

[INFO] --- maven-jar-plugin:2.4:jar (default-jar) @ cloud-engine-storage-integration-test
---
[INFO] 
[INFO] --- maven-site-plugin:3.1:attach-descriptor (attach-descriptor) @ cloud-engine-storage-integration-test
---
[INFO] [INFO] Tests are skipped.

[INFO] --- maven-surefire-plugin:2.12:test (default) @ cloud-engine-storage-integration-test
---
[INFO] [INFO] Installing <https://builds.apache.org/job/cloudstack-apidocs-41/ws/engine/storage/integration-test/target/cloud-engine-storage-integration-test-4.1.1-SNAPSHOT.jar>
to /home/jenkins/jenkins-slave/maven-repositories/0/org/apache/cloudstack/cloud-engine-storage-integration-test/4.1.1-SNAPSHOT/cloud-engine-storage-integration-test-4.1.1-SNAPSHOT.jar
[INFO] Installing <https://builds.apache.org/job/cloudstack-apidocs-41/ws/engine/storage/integration-test/pom.xml>
to /home/jenkins/jenkins-slave/maven-repositories/0/org/apache/cloudstack/cloud-engine-storage-integration-test/4.1.1-SNAPSHOT/cloud-engine-storage-integration-test-4.1.1-SNAPSHOT.pom

[INFO] --- maven-install-plugin:2.3.1:install (default-install) @ cloud-engine-storage-integration-test
---
[INFO]                                                                         
[INFO] ------------------------------------------------------------------------
[INFO] Building Apache CloudStack Cloud Engine Service 4.1.1-SNAPSHOT
[INFO] ------------------------------------------------------------------------
[INFO] Deleting <https://builds.apache.org/job/cloudstack-apidocs-41/ws/engine/service/target>
[INFO] 
[INFO] --- maven-clean-plugin:2.5:clean (default-clean) @ cloud-engine-service ---
[INFO] 
[INFO] --- maven-remote-resources-plugin:1.3:process (default) @ cloud-engine-service ---
[debug] execute contextualize
[INFO] [INFO] Using 'UTF-8' encoding to copy filtered resources.
[INFO] skip non existing resourceDirectory <https://builds.apache.org/job/cloudstack-apidocs-41/ws/engine/service/src/main/resources>
[INFO] Copying 3 resources

[INFO] --- maven-resources-plugin:2.5:resources (default-resources) @ cloud-engine-service
---
[INFO] [INFO] Nothing to compile - all classes are up to date

[INFO] --- maven-compiler-plugin:2.5.1:compile (default-compile) @ cloud-engine-service ---
[debug] execute contextualize
[INFO] [INFO] Using 'UTF-8' encoding to copy filtered resources.
[INFO] skip non existing resourceDirectory <https://builds.apache.org/job/cloudstack-apidocs-41/ws/engine/service/src/test/resources>
[INFO] Copying 3 resources

[INFO] --- maven-resources-plugin:2.5:testResources (default-testResources) @ cloud-engine-service
---
[INFO] [INFO] No sources to compile

[INFO] --- maven-compiler-plugin:2.5.1:testCompile (default-testCompile) @ cloud-engine-service
---
[INFO] [INFO] Surefire report directory: <https://builds.apache.org/job/cloudstack-apidocs-41/ws/engine/service/target/surefire-reports>

-------------------------------------------------------
 T E S T S
-------------------------------------------------------

[INFO] --- maven-surefire-plugin:2.12:test (default-test) @ cloud-engine-service ---

Results :

Tests run: 0, Failures: 0, Errors: 0, Skipped: 0

[JENKINS] Recording test results
[INFO] 
[INFO] --- maven-war-plugin:2.1.1:war (default-war) @ cloud-engine-service ---
[INFO] Packaging webapp
[INFO] Assembling webapp [cloud-engine-service] in [<https://builds.apache.org/job/cloudstack-apidocs-41/ws/engine/service/target/engine]>
[INFO] Processing war project
[INFO] Copying webapp resources [<https://builds.apache.org/job/cloudstack-apidocs-41/ws/engine/service/src/main/webapp]>
[INFO] Webapp assembled in [551 msecs]
[INFO] Building war: <https://builds.apache.org/job/cloudstack-apidocs-41/ws/engine/service/target/engine.war>
[INFO] WEB-INF/web.xml already added, skipping
[INFO] 
[INFO] --- maven-site-plugin:3.1:attach-descriptor (attach-descriptor) @ cloud-engine-service
---
[INFO] [INFO] Installing <https://builds.apache.org/job/cloudstack-apidocs-41/ws/engine/service/target/engine.war>
to /home/jenkins/jenkins-slave/maven-repositories/0/org/apache/cloudstack/cloud-engine-service/4.1.1-SNAPSHOT/cloud-engine-service-4.1.1-SNAPSHOT.war

[INFO] --- maven-install-plugin:2.3.1:install (default-install) @ cloud-engine-service ---
[INFO] Installing <https://builds.apache.org/job/cloudstack-apidocs-41/ws/engine/service/pom.xml>
to /home/jenkins/jenkins-slave/maven-repositories/0/org/apache/cloudstack/cloud-engine-service/4.1.1-SNAPSHOT/cloud-engine-service-4.1.1-SNAPSHOT.pom
[INFO] ------------------------------------------------------------------------
[INFO] Reactor Summary:
[INFO] 
[INFO] Apache CloudStack ................................. SUCCESS [17.842s]
[INFO] Apache CloudStack Utils ........................... SUCCESS [23.345s]
[INFO] Apache CloudStack API ............................. SUCCESS [13.411s]
[INFO] Apache CloudStack Core ............................ SUCCESS [6.771s]
[INFO] Apache CloudStack Agents .......................... SUCCESS [7.268s]
[INFO] Apache CloudStack SystemVM Patches ................ SUCCESS [1.890s]
[INFO] Apache CloudStack Console Proxy ................... SUCCESS [9.652s]
[INFO] Apache CloudStack Framework ....................... SUCCESS [0.830s]
[INFO] Apache CloudStack Framework - IPC ................. SUCCESS [4.605s]
[INFO] Apache CloudStack Framework - REST ................ SUCCESS [3.527s]
[INFO] Apache CloudStack Cloud Engine .................... SUCCESS [0.642s]
[INFO] Apache CloudStack Cloud Engine API ................ SUCCESS [4.115s]
[INFO] Apache CloudStack Framework - Event Notification .. SUCCESS [2.781s]
[INFO] Apache CloudStack Server .......................... SUCCESS [23.999s]
[INFO] Apache CloudStack Usage Server .................... SUCCESS [5.641s]
[INFO] Apache XenSource XAPI ............................. SUCCESS [4.534s]
[INFO] Apache CloudStack Plugin POM ...................... SUCCESS [0.741s]
[INFO] Apache CloudStack Plugin - API Rate Limit ......... SUCCESS [6.360s]
[INFO] Apache CloudStack Plugin - API Discovery .......... SUCCESS [5.408s]
[INFO] Apache CloudStack Plugin - ACL Static Role Based .. SUCCESS [3.735s]
[INFO] Apache CloudStack Plugin - User Concentrated Pod Deployment Planner  SUCCESS [3.210s]
[INFO] Apache CloudStack Plugin - User Dispersing Deployment Planner  SUCCESS [3.203s]
[INFO] Apache CloudStack Plugin - Host Allocator Random .. SUCCESS [3.001s]
[INFO] Apache CloudStack Plugin - Hypervisor OracleVM .... SUCCESS [4.345s]
[INFO] Apache CloudStack Cloud Engine Internal Components API  SUCCESS [2.852s]
[INFO] Apache CloudStack Engine Storage Component ........ SUCCESS [4.290s]
[INFO] Apache CloudStack Plugin - Open vSwitch ........... SUCCESS [3.382s]
[INFO] Apache CloudStack Plugin - Hypervisor Xen ......... SUCCESS [4.014s]
[INFO] Apache CloudStack Plugin - Hypervisor KVM ......... SUCCESS [5.749s]
[INFO] Apache CloudStack Plugin - RabbitMQ Event Bus ..... SUCCESS [3.372s]
[INFO] Apache CloudStack Plugin - Hypervisor Simulator ... SUCCESS [3.699s]
[INFO] Apache CloudStack Plugin - Network Elastic Load Balancer  SUCCESS [3.550s]
[INFO] Apache CloudStack Plugin - Network Nicira NVP ..... SUCCESS [6.657s]
[INFO] Apache CloudStack Plugin - BigSwitch Virtual Network Segment  SUCCESS [5.590s]
[INFO] Apache CloudStack Plugin - Storage Allocator Random  SUCCESS [2.844s]
[INFO] Apache CloudStack Plugin - User Authenticator LDAP  SUCCESS [3.556s]
[INFO] Apache CloudStack Plugin - User Authenticator MD5 . SUCCESS [3.197s]
[INFO] Apache CloudStack Plugin - User Authenticator Plain Text  SUCCESS [5.465s]
[INFO] Apache CloudStack Plugin - User Authenticator SHA256 Salted  SUCCESS [4.270s]
[INFO] Apache CloudStack Plugin - Dns Notifier Example ... SUCCESS [3.138s]
[INFO] Apache CloudStack Engine Storage Image Component .. SUCCESS [3.309s]
[INFO] Apache CloudStack Plugin - Storage Image S3 ....... SUCCESS [2.108s]
[INFO] Apache CloudStack Engine Storage Volume Component . SUCCESS [4.428s]
[INFO] Apache CloudStack Plugin - Storage Volume solidfire  SUCCESS [3.613s]
[INFO] Apache CloudStack Cloud Engine Compute Component .. SUCCESS [2.868s]
[INFO] Apache CloudStack Cloud Engine API ................ SUCCESS [2.738s]
[INFO] Apache CloudStack Cloud Engine Orchestration Component  SUCCESS [5.611s]
[INFO] Apache CloudStack Cloud Engine Schema Component ... SUCCESS [4.491s]
[INFO] Apache CloudStack Engine Storage Backup Component . SUCCESS [2.922s]
[INFO] Apache CloudStack Engine Storage Image Motion Component  SUCCESS [2.994s]
[INFO] Apache CloudStack Engine Storage Snapshot Component  SUCCESS [3.475s]
[INFO] Apache CloudStack Client UI ....................... SUCCESS [11.217s]
[INFO] Apache CloudStack Test ............................ SUCCESS [6.529s]
[INFO] Apache CloudStack Engine Storage integration test Component  SUCCESS [6.147s]
[INFO] Apache CloudStack Cloud Engine Service ............ SUCCESS [8.604s]
[INFO] ------------------------------------------------------------------------
[INFO] BUILD SUCCESS
[INFO] ------------------------------------------------------------------------
[INFO] Total time: 5:08.465s
[INFO] Finished at: Mon Jun 17 23:00:36 UTC 2013
[INFO] Final Memory: 38M/141M
[INFO] ------------------------------------------------------------------------
[JENKINS] Archiving disabled
[JENKINS] Archiving disabled
[JENKINS] Archiving disabled
[JENKINS] Archiving disabled
[JENKINS] Archiving disabled
[JENKINS] Archiving disabled
[JENKINS] Archiving disabled
[JENKINS] Archiving disabled
[JENKINS] Archiving disabled
[JENKINS] Archiving disabled
[JENKINS] Archiving disabled
[JENKINS] Archiving disabled
[JENKINS] Archiving disabled
[JENKINS] Archiving disabled
[JENKINS] Archiving disabled
[JENKINS] Archiving disabled
[JENKINS] Archiving disabled
[JENKINS] Archiving disabled
[JENKINS] Archiving disabled
[JENKINS] Archiving disabled
[JENKINS] Archiving disabled
[JENKINS] Archiving disabled
[JENKINS] Archiving disabled
[JENKINS] Archiving disabled
[JENKINS] Archiving disabled
[JENKINS] Archiving disabled
[JENKINS] Archiving disabled
[JENKINS] Archiving disabled
[JENKINS] Archiving disabled
[JENKINS] Archiving disabled
[JENKINS] Archiving disabled
[JENKINS] Archiving disabled
[JENKINS] Archiving disabled
[JENKINS] Archiving disabled
[JENKINS] Archiving disabled
[JENKINS] Archiving disabled
[JENKINS] Archiving disabled
[JENKINS] Archiving disabled
[JENKINS] Archiving disabled
[JENKINS] Archiving disabled
[JENKINS] Archiving disabled
[JENKINS] Archiving disabled
[JENKINS] Archiving disabled
[JENKINS] Archiving disabled
[JENKINS] Archiving disabled
[JENKINS] Archiving disabled
[JENKINS] Archiving disabled
[JENKINS] Archiving disabled
[JENKINS] Archiving disabled
[JENKINS] Archiving disabled
[JENKINS] Archiving disabled
[JENKINS] Archiving disabled
[JENKINS] Archiving disabled
[JENKINS] Archiving disabled
[JENKINS] Archiving disabled
Waiting for Jenkins to finish collecting data
channel stopped
[cloudstack-apidocs-41] $ /bin/bash -xe /tmp/hudson3298521675234719843.sh
+ mvn -P developer -pl :cloud-apidoc
[INFO] Scanning for projects...
[INFO]                                                                         
[INFO] ------------------------------------------------------------------------
[INFO] Building Apache CloudStack apidoc Tools 4.1.1-SNAPSHOT
[INFO] ------------------------------------------------------------------------
Downloading: http://repository.apache.org/snapshots/org/apache/cloudstack/cloud-client-ui/4.1.1-SNAPSHOT/maven-metadata.xml

Downloading: http://repository.apache.org/snapshots/org/apache/cloudstack/cloud-client-ui/4.1.1-SNAPSHOT/cloud-client-ui-4.1.1-SNAPSHOT.war

[INFO] ------------------------------------------------------------------------
[INFO] BUILD FAILURE
[INFO] ------------------------------------------------------------------------
[INFO] Total time: 3.837s
[INFO] Finished at: Mon Jun 17 23:01:06 UTC 2013
[INFO] Final Memory: 12M/79M
[INFO] ------------------------------------------------------------------------
[ERROR] Failed to execute goal on project cloud-apidoc: Could not resolve dependencies for
project org.apache.cloudstack:cloud-apidoc:pom:4.1.1-SNAPSHOT: Could not find artifact org.apache.cloudstack:cloud-client-ui:war:4.1.1-SNAPSHOT
in Nexus (http://repository.apache.org/snapshots) -> [Help 1]
[ERROR] 
[ERROR] To see the full stack trace of the errors, re-run Maven with the -e switch.
[ERROR] Re-run Maven using the -X switch to enable full debug logging.
[ERROR] 
[ERROR] For more information about the errors and possible solutions, please read the following
articles:
[ERROR] [Help 1] http://cwiki.apache.org/confluence/display/MAVEN/DependencyResolutionException
Build step 'Execute shell' marked build as failure
Archiving artifacts

Mime
View raw message