cloudstack-commits mailing list archives

Site index · List index
Message view « Date » · « Thread »
Top « Date » · « Thread »
From Apache Jenkins Server <jenk...@builds.apache.org>
Subject Build failed in Jenkins: cloudstack-marvin-41 #483
Date Thu, 27 Jun 2013 15:58:08 GMT
See <https://builds.apache.org/job/cloudstack-marvin-41/483/>

------------------------------------------
[...truncated 655 lines...]
[INFO] --- maven-resources-plugin:2.5:testResources (default-testResources) @ cloud-framework-ipc
---
[INFO] [INFO] Compiling 11 source files to <https://builds.apache.org/job/cloudstack-marvin-41/ws/framework/ipc/target/test-classes>

[INFO] --- maven-compiler-plugin:2.5.1:testCompile (default-testCompile) @ cloud-framework-ipc
---
[INFO] Surefire report directory: <https://builds.apache.org/job/cloudstack-marvin-41/ws/framework/ipc/target/surefire-reports>
[INFO] 
-------------------------------------------------------
 T E S T S
-------------------------------------------------------

[INFO] --- maven-surefire-plugin:2.12:test (default-test) @ cloud-framework-ipc ---

Results :

Tests run: 0, Failures: 0, Errors: 0, Skipped: 0

[JENKINS] Recording test results
[INFO] [INFO] Building jar: <https://builds.apache.org/job/cloudstack-marvin-41/ws/framework/ipc/target/cloud-framework-ipc-4.1.1-SNAPSHOT.jar>

[INFO] --- maven-jar-plugin:2.4:jar (default-jar) @ cloud-framework-ipc ---
[INFO] 
[INFO] --- maven-site-plugin:3.1:attach-descriptor (attach-descriptor) @ cloud-framework-ipc
---
[INFO] [INFO] Installing <https://builds.apache.org/job/cloudstack-marvin-41/ws/framework/ipc/target/cloud-framework-ipc-4.1.1-SNAPSHOT.jar>
to /home/jenkins/jenkins-slave/maven-repositories/1/org/apache/cloudstack/cloud-framework-ipc/4.1.1-SNAPSHOT/cloud-framework-ipc-4.1.1-SNAPSHOT.jar
[INFO] Installing <https://builds.apache.org/job/cloudstack-marvin-41/ws/framework/ipc/pom.xml>
to /home/jenkins/jenkins-slave/maven-repositories/1/org/apache/cloudstack/cloud-framework-ipc/4.1.1-SNAPSHOT/cloud-framework-ipc-4.1.1-SNAPSHOT.pom

[INFO] --- maven-install-plugin:2.3.1:install (default-install) @ cloud-framework-ipc ---
[INFO]                                                                         
[INFO] ------------------------------------------------------------------------
[INFO] Building Apache CloudStack Framework - REST 4.1.1-SNAPSHOT
[INFO] ------------------------------------------------------------------------
[INFO] Deleting <https://builds.apache.org/job/cloudstack-marvin-41/ws/framework/rest/target>
[INFO] 
[INFO] --- maven-clean-plugin:2.5:clean (default-clean) @ cloud-framework-rest ---
[INFO] 
[INFO] --- maven-remote-resources-plugin:1.3:process (default) @ cloud-framework-rest ---
[debug] execute contextualize
[INFO] [INFO] Using 'UTF-8' encoding to copy filtered resources.
[INFO] skip non existing resourceDirectory <https://builds.apache.org/job/cloudstack-marvin-41/ws/framework/rest/src/main/resources>
[INFO] Copying 3 resources

[INFO] --- maven-resources-plugin:2.5:resources (default-resources) @ cloud-framework-rest
---
[INFO] [INFO] Compiling 5 source files to <https://builds.apache.org/job/cloudstack-marvin-41/ws/framework/rest/target/classes>

[INFO] --- maven-compiler-plugin:2.5.1:compile (default-compile) @ cloud-framework-rest ---
[debug] execute contextualize
[INFO] [INFO] Using 'UTF-8' encoding to copy filtered resources.
[INFO] skip non existing resourceDirectory <https://builds.apache.org/job/cloudstack-marvin-41/ws/framework/rest/src/test/resources>
[INFO] Copying 3 resources

[INFO] --- maven-resources-plugin:2.5:testResources (default-testResources) @ cloud-framework-rest
---
[INFO] Compiling 1 source file to <https://builds.apache.org/job/cloudstack-marvin-41/ws/framework/rest/target/test-classes>
[INFO] 
[INFO] --- maven-compiler-plugin:2.5.1:testCompile (default-testCompile) @ cloud-framework-rest
---
[INFO] Surefire report directory: <https://builds.apache.org/job/cloudstack-marvin-41/ws/framework/rest/target/surefire-reports>
[INFO] 
-------------------------------------------------------
 T E S T S
-------------------------------------------------------

[INFO] --- maven-surefire-plugin:2.12:test (default-test) @ cloud-framework-rest ---
Running org.apache.cloudstack.framework.ws.jackson.CSJacksonAnnotationTest
Tests run: 1, Failures: 0, Errors: 0, Skipped: 1, Time elapsed: 0.034 sec

Results :

Tests run: 1, Failures: 0, Errors: 0, Skipped: 1

[JENKINS] Recording test results
[INFO] [INFO] Building jar: <https://builds.apache.org/job/cloudstack-marvin-41/ws/framework/rest/target/cloud-framework-rest-4.1.1-SNAPSHOT.jar>

[INFO] --- maven-jar-plugin:2.4:jar (default-jar) @ cloud-framework-rest ---
[INFO] 
[INFO] --- maven-site-plugin:3.1:attach-descriptor (attach-descriptor) @ cloud-framework-rest
---
[INFO] Installing <https://builds.apache.org/job/cloudstack-marvin-41/ws/framework/rest/target/cloud-framework-rest-4.1.1-SNAPSHOT.jar>
to /home/jenkins/jenkins-slave/maven-repositories/1/org/apache/cloudstack/cloud-framework-rest/4.1.1-SNAPSHOT/cloud-framework-rest-4.1.1-SNAPSHOT.jar
[INFO] [INFO] Installing <https://builds.apache.org/job/cloudstack-marvin-41/ws/framework/rest/pom.xml>
to /home/jenkins/jenkins-slave/maven-repositories/1/org/apache/cloudstack/cloud-framework-rest/4.1.1-SNAPSHOT/cloud-framework-rest-4.1.1-SNAPSHOT.pom

[INFO] --- maven-install-plugin:2.3.1:install (default-install) @ cloud-framework-rest ---
[INFO] [INFO] Deleting <https://builds.apache.org/job/cloudstack-marvin-41/ws/engine/target>
                                                                        
[INFO] ------------------------------------------------------------------------
[INFO] Building Apache CloudStack Cloud Engine 4.1.1-SNAPSHOT
[INFO] ------------------------------------------------------------------------
[INFO] 
[INFO] --- maven-clean-plugin:2.5:clean (default-clean) @ cloud-engine ---
[INFO] 
[INFO] --- maven-remote-resources-plugin:1.3:process (default) @ cloud-engine ---
[INFO] 
[INFO] --- maven-site-plugin:3.1:attach-descriptor (attach-descriptor) @ cloud-engine ---
[INFO] [INFO] Installing <https://builds.apache.org/job/cloudstack-marvin-41/ws/engine/pom.xml>
to /home/jenkins/jenkins-slave/maven-repositories/1/org/apache/cloudstack/cloud-engine/4.1.1-SNAPSHOT/cloud-engine-4.1.1-SNAPSHOT.pom

[INFO] --- maven-install-plugin:2.3.1:install (default-install) @ cloud-engine ---
[INFO] [INFO] Deleting <https://builds.apache.org/job/cloudstack-marvin-41/ws/engine/api/target>
                                                                        
[INFO] ------------------------------------------------------------------------
[INFO] Building Apache CloudStack Cloud Engine API 4.1.1-SNAPSHOT
[INFO] ------------------------------------------------------------------------
[INFO] 
[INFO] --- maven-clean-plugin:2.5:clean (default-clean) @ cloud-engine-api ---
[INFO] 
[INFO] --- maven-remote-resources-plugin:1.3:process (default) @ cloud-engine-api ---
[debug] execute contextualize
[INFO] [INFO] Using 'UTF-8' encoding to copy filtered resources.
[INFO] skip non existing resourceDirectory <https://builds.apache.org/job/cloudstack-marvin-41/ws/engine/api/src/main/resources>
[INFO] Copying 3 resources

[INFO] --- maven-resources-plugin:2.5:resources (default-resources) @ cloud-engine-api ---
[INFO] [INFO] Compiling 74 source files to <https://builds.apache.org/job/cloudstack-marvin-41/ws/engine/api/target/classes>

[INFO] --- maven-compiler-plugin:2.5.1:compile (default-compile) @ cloud-engine-api ---
[INFO] [debug] execute contextualize
[INFO] Using 'UTF-8' encoding to copy filtered resources.
[INFO] skip non existing resourceDirectory <https://builds.apache.org/job/cloudstack-marvin-41/ws/engine/api/src/test/resources>
[INFO] Copying 3 resources

[INFO] --- maven-resources-plugin:2.5:testResources (default-testResources) @ cloud-engine-api
---
[INFO] No sources to compile
[INFO] 
[INFO] --- maven-compiler-plugin:2.5.1:testCompile (default-testCompile) @ cloud-engine-api
---
[INFO] [INFO] Surefire report directory: <https://builds.apache.org/job/cloudstack-marvin-41/ws/engine/api/target/surefire-reports>

-------------------------------------------------------
 T E S T S
-------------------------------------------------------

[INFO] --- maven-surefire-plugin:2.12:test (default-test) @ cloud-engine-api ---

Results :

Tests run: 0, Failures: 0, Errors: 0, Skipped: 0

[JENKINS] Recording test results
[INFO] [INFO] Building jar: <https://builds.apache.org/job/cloudstack-marvin-41/ws/engine/api/target/cloud-engine-api-4.1.1-SNAPSHOT.jar>

[INFO] --- maven-jar-plugin:2.4:jar (default-jar) @ cloud-engine-api ---
[INFO] 
[INFO] --- maven-site-plugin:3.1:attach-descriptor (attach-descriptor) @ cloud-engine-api
---
[INFO] [INFO] Installing <https://builds.apache.org/job/cloudstack-marvin-41/ws/engine/api/target/cloud-engine-api-4.1.1-SNAPSHOT.jar>
to /home/jenkins/jenkins-slave/maven-repositories/1/org/apache/cloudstack/cloud-engine-api/4.1.1-SNAPSHOT/cloud-engine-api-4.1.1-SNAPSHOT.jar
[INFO] Installing <https://builds.apache.org/job/cloudstack-marvin-41/ws/engine/api/pom.xml>
to /home/jenkins/jenkins-slave/maven-repositories/1/org/apache/cloudstack/cloud-engine-api/4.1.1-SNAPSHOT/cloud-engine-api-4.1.1-SNAPSHOT.pom

[INFO] --- maven-install-plugin:2.3.1:install (default-install) @ cloud-engine-api ---
[INFO] [INFO] Deleting <https://builds.apache.org/job/cloudstack-marvin-41/ws/framework/events/target>
                                                                        
[INFO] ------------------------------------------------------------------------
[INFO] Building Apache CloudStack Framework - Event Notification 4.1.1-SNAPSHOT
[INFO] ------------------------------------------------------------------------
[INFO] 
[INFO] --- maven-clean-plugin:2.5:clean (default-clean) @ cloud-framework-events ---
[INFO] 
[INFO] --- maven-remote-resources-plugin:1.3:process (default) @ cloud-framework-events ---
[debug] execute contextualize
[INFO] [INFO] Using 'UTF-8' encoding to copy filtered resources.
[INFO] skip non existing resourceDirectory <https://builds.apache.org/job/cloudstack-marvin-41/ws/framework/events/src/main/resources>
[INFO] Copying 3 resources

[INFO] --- maven-resources-plugin:2.5:resources (default-resources) @ cloud-framework-events
---
[INFO] [INFO] Compiling 5 source files to <https://builds.apache.org/job/cloudstack-marvin-41/ws/framework/events/target/classes>

[INFO] --- maven-compiler-plugin:2.5.1:compile (default-compile) @ cloud-framework-events
---
[debug] execute contextualize
[INFO] [INFO] Using 'UTF-8' encoding to copy filtered resources.
[INFO] skip non existing resourceDirectory <https://builds.apache.org/job/cloudstack-marvin-41/ws/framework/events/src/test/resources>
[INFO] Copying 3 resources

[INFO] --- maven-resources-plugin:2.5:testResources (default-testResources) @ cloud-framework-events
---
[INFO] [INFO] No sources to compile

[INFO] --- maven-compiler-plugin:2.5.1:testCompile (default-testCompile) @ cloud-framework-events
---
[INFO] [INFO] Surefire report directory: <https://builds.apache.org/job/cloudstack-marvin-41/ws/framework/events/target/surefire-reports>

-------------------------------------------------------
 T E S T S
-------------------------------------------------------

[INFO] --- maven-surefire-plugin:2.12:test (default-test) @ cloud-framework-events ---

Results :

Tests run: 0, Failures: 0, Errors: 0, Skipped: 0

[JENKINS] Recording test results
[INFO] [INFO] Building jar: <https://builds.apache.org/job/cloudstack-marvin-41/ws/framework/events/target/cloud-framework-events-4.1.1-SNAPSHOT.jar>

[INFO] --- maven-jar-plugin:2.4:jar (default-jar) @ cloud-framework-events ---
[INFO] 
[INFO] --- maven-site-plugin:3.1:attach-descriptor (attach-descriptor) @ cloud-framework-events
---
[INFO] [INFO] Installing <https://builds.apache.org/job/cloudstack-marvin-41/ws/framework/events/target/cloud-framework-events-4.1.1-SNAPSHOT.jar>
to /home/jenkins/jenkins-slave/maven-repositories/1/org/apache/cloudstack/cloud-framework-events/4.1.1-SNAPSHOT/cloud-framework-events-4.1.1-SNAPSHOT.jar
[INFO] Installing <https://builds.apache.org/job/cloudstack-marvin-41/ws/framework/events/pom.xml>
to /home/jenkins/jenkins-slave/maven-repositories/1/org/apache/cloudstack/cloud-framework-events/4.1.1-SNAPSHOT/cloud-framework-events-4.1.1-SNAPSHOT.pom

[INFO] --- maven-install-plugin:2.3.1:install (default-install) @ cloud-framework-events ---
[INFO] [INFO] Deleting <https://builds.apache.org/job/cloudstack-marvin-41/ws/server/target>
                                                                        
[INFO] ------------------------------------------------------------------------
[INFO] Building Apache CloudStack Server 4.1.1-SNAPSHOT
[INFO] ------------------------------------------------------------------------
[INFO] 
[INFO] --- maven-clean-plugin:2.5:clean (default-clean) @ cloud-server ---
[INFO] 
[INFO] --- maven-remote-resources-plugin:1.3:process (default) @ cloud-server ---
[INFO] [INFO] Executing tasks

main:
     [copy] Copying 3 files to <https://builds.apache.org/job/cloudstack-marvin-41/ws/server/target/conf>
     [copy] Copying 1 file to <https://builds.apache.org/job/cloudstack-marvin-41/ws/server/target/conf>
[INFO] Executed tasks

[INFO] --- maven-antrun-plugin:1.7:run (generate-resource) @ cloud-server ---
[debug] execute contextualize
[INFO] [INFO] Using 'UTF-8' encoding to copy filtered resources.
[INFO] Copying 1 resource
[INFO] Copying 3 resources

[INFO] --- maven-resources-plugin:2.5:resources (default-resources) @ cloud-server ---
[INFO] [INFO] Compiling 853 source files to <https://builds.apache.org/job/cloudstack-marvin-41/ws/server/target/classes>

[INFO] --- maven-compiler-plugin:2.5.1:compile (default-compile) @ cloud-server ---
[cloudstack-marvin-41] $ /bin/bash -xe /tmp/hudson7240234959522418105.sh
+ mvn -P developer -pl :cloud-apidoc -pl :cloud-marvin
[INFO] Scanning for projects...
[INFO] ------------------------------------------------------------------------
[INFO] Reactor Build Order:
[INFO] 
[INFO] Apache CloudStack apidoc Tools
[INFO] Apache CloudStack Developer Tools: marvin
[INFO]                                                                         
[INFO] ------------------------------------------------------------------------
[INFO] Building Apache CloudStack apidoc Tools 4.1.1-SNAPSHOT
[INFO] ------------------------------------------------------------------------
[INFO] ------------------------------------------------------------------------
[INFO] Reactor Summary:
[INFO] 
[INFO] Apache CloudStack apidoc Tools .................... FAILURE [1.021s]
[INFO] Apache CloudStack Developer Tools: marvin ......... SKIPPED
[INFO] ------------------------------------------------------------------------
[INFO] BUILD FAILURE
[INFO] ------------------------------------------------------------------------
[INFO] Total time: 2.190s
[INFO] Finished at: Thu Jun 27 15:58:05 UTC 2013
[INFO] Final Memory: 12M/109M
[INFO] ------------------------------------------------------------------------
[ERROR] Failed to execute goal on project cloud-apidoc: Could not resolve dependencies for
project org.apache.cloudstack:cloud-apidoc:pom:4.1.1-SNAPSHOT: Failure to find org.apache.cloudstack:cloud-client-ui:war:4.1.1-SNAPSHOT
in http://repository.apache.org/snapshots was cached in the local repository, resolution will
not be reattempted until the update interval of Nexus has elapsed or updates are forced ->
[Help 1]
[ERROR] 
[ERROR] To see the full stack trace of the errors, re-run Maven with the -e switch.
[ERROR] Re-run Maven using the -X switch to enable full debug logging.
[ERROR] 
[ERROR] For more information about the errors and possible solutions, please read the following
articles:
[ERROR] [Help 1] http://cwiki.apache.org/confluence/display/MAVEN/DependencyResolutionException
Build step 'Execute shell' marked build as failure
ERROR: Maven JVM terminated unexpectedly with exit code 143
Archiving artifacts

Mime
View raw message