cloudstack-commits mailing list archives

Site index · List index
Message view « Date » · « Thread »
Top « Date » · « Thread »
From Apache Jenkins Server <jenk...@builds.apache.org>
Subject Build failed in Jenkins: cloudstack-marvin-41 #443
Date Sat, 22 Jun 2013 08:46:17 GMT
See <https://builds.apache.org/job/cloudstack-marvin-41/443/changes>

Changes:

[tsp] RPM build - run mvn clean before building packages, to get a build from fresh source

[tsp] mvn clean does not do a complete clean

------------------------------------------
[...truncated 3075 lines...]
[INFO] [INFO] Using 'UTF-8' encoding to copy filtered resources.
[INFO] skip non existing resourceDirectory <https://builds.apache.org/job/cloudstack-marvin-41/ws/engine/storage/integration-test/src/main/resources>
[INFO] Copying 3 resources

[INFO] --- maven-resources-plugin:2.5:resources (default-resources) @ cloud-engine-storage-integration-test
---
[INFO] [INFO] No sources to compile

[INFO] --- maven-compiler-plugin:2.5.1:compile (default-compile) @ cloud-engine-storage-integration-test
---
[debug] execute contextualize
[INFO] [INFO] Using 'UTF-8' encoding to copy filtered resources.
[INFO] Copying 2 resources
[INFO] Copying 3 resources

[INFO] --- maven-resources-plugin:2.5:testResources (default-testResources) @ cloud-engine-storage-integration-test
---
[INFO] [INFO] Compiling 18 source files to <https://builds.apache.org/job/cloudstack-marvin-41/ws/engine/storage/integration-test/target/test-classes>

[INFO] --- maven-compiler-plugin:2.5.1:testCompile (default-testCompile) @ cloud-engine-storage-integration-test
---
[INFO] [INFO] Nothing to compile - all classes are up to date

[INFO] --- maven-compiler-plugin:2.5.1:testCompile (default) @ cloud-engine-storage-integration-test
---
[INFO] [INFO] Tests are skipped.

[INFO] --- maven-surefire-plugin:2.12:test (default-test) @ cloud-engine-storage-integration-test
---
[INFO] 
[INFO] --- maven-jar-plugin:2.4:jar (default-jar) @ cloud-engine-storage-integration-test
---
[INFO] Building jar: <https://builds.apache.org/job/cloudstack-marvin-41/ws/engine/storage/integration-test/target/cloud-engine-storage-integration-test-4.1.1-SNAPSHOT.jar>
[INFO] 
[INFO] --- maven-site-plugin:3.1:attach-descriptor (attach-descriptor) @ cloud-engine-storage-integration-test
---
[INFO] [INFO] Tests are skipped.

[INFO] --- maven-surefire-plugin:2.12:test (default) @ cloud-engine-storage-integration-test
---
[INFO] [INFO] Installing <https://builds.apache.org/job/cloudstack-marvin-41/ws/engine/storage/integration-test/target/cloud-engine-storage-integration-test-4.1.1-SNAPSHOT.jar>
to /home/jenkins/jenkins-slave/maven-repositories/0/org/apache/cloudstack/cloud-engine-storage-integration-test/4.1.1-SNAPSHOT/cloud-engine-storage-integration-test-4.1.1-SNAPSHOT.jar
[INFO] Installing <https://builds.apache.org/job/cloudstack-marvin-41/ws/engine/storage/integration-test/pom.xml>
to /home/jenkins/jenkins-slave/maven-repositories/0/org/apache/cloudstack/cloud-engine-storage-integration-test/4.1.1-SNAPSHOT/cloud-engine-storage-integration-test-4.1.1-SNAPSHOT.pom

[INFO] --- maven-install-plugin:2.3.1:install (default-install) @ cloud-engine-storage-integration-test
---
[INFO]                                                                         
[INFO] ------------------------------------------------------------------------
[INFO] Building Apache CloudStack Cloud Engine Service 4.1.1-SNAPSHOT
[INFO] ------------------------------------------------------------------------
[INFO] [INFO] Deleting <https://builds.apache.org/job/cloudstack-marvin-41/ws/engine/service/target>

[INFO] --- maven-clean-plugin:2.5:clean (default-clean) @ cloud-engine-service ---
[INFO] 
[INFO] --- maven-remote-resources-plugin:1.3:process (default) @ cloud-engine-service ---
[debug] execute contextualize
[INFO] [INFO] Using 'UTF-8' encoding to copy filtered resources.
[INFO] skip non existing resourceDirectory <https://builds.apache.org/job/cloudstack-marvin-41/ws/engine/service/src/main/resources>
[INFO] Copying 3 resources

[INFO] --- maven-resources-plugin:2.5:resources (default-resources) @ cloud-engine-service
---
[INFO] [INFO] Nothing to compile - all classes are up to date

[INFO] --- maven-compiler-plugin:2.5.1:compile (default-compile) @ cloud-engine-service ---
[debug] execute contextualize
[INFO] [INFO] Using 'UTF-8' encoding to copy filtered resources.
[INFO] skip non existing resourceDirectory <https://builds.apache.org/job/cloudstack-marvin-41/ws/engine/service/src/test/resources>
[INFO] Copying 3 resources

[INFO] --- maven-resources-plugin:2.5:testResources (default-testResources) @ cloud-engine-service
---
[INFO] [INFO] No sources to compile

[INFO] --- maven-compiler-plugin:2.5.1:testCompile (default-testCompile) @ cloud-engine-service
---
[INFO] [INFO] Surefire report directory: <https://builds.apache.org/job/cloudstack-marvin-41/ws/engine/service/target/surefire-reports>

[INFO] --- maven-surefire-plugin:2.12:test (default-test) @ cloud-engine-service ---

-------------------------------------------------------
 T E S T S
-------------------------------------------------------

Results :

Tests run: 0, Failures: 0, Errors: 0, Skipped: 0

[JENKINS] Recording test results
[INFO] 
[INFO] --- maven-war-plugin:2.1.1:war (default-war) @ cloud-engine-service ---
[INFO] Packaging webapp
[INFO] Assembling webapp [cloud-engine-service] in [<https://builds.apache.org/job/cloudstack-marvin-41/ws/engine/service/target/engine]>
[INFO] Processing war project
[INFO] Copying webapp resources [<https://builds.apache.org/job/cloudstack-marvin-41/ws/engine/service/src/main/webapp]>
[INFO] Webapp assembled in [113 msecs]
[INFO] Building war: <https://builds.apache.org/job/cloudstack-marvin-41/ws/engine/service/target/engine.war>
[INFO] WEB-INF/web.xml already added, skipping
[INFO] 
[INFO] --- maven-site-plugin:3.1:attach-descriptor (attach-descriptor) @ cloud-engine-service
---
[INFO] Installing <https://builds.apache.org/job/cloudstack-marvin-41/ws/engine/service/target/engine.war>
to /home/jenkins/jenkins-slave/maven-repositories/0/org/apache/cloudstack/cloud-engine-service/4.1.1-SNAPSHOT/cloud-engine-service-4.1.1-SNAPSHOT.war
[INFO] 
[INFO] --- maven-install-plugin:2.3.1:install (default-install) @ cloud-engine-service ---
[INFO] Installing <https://builds.apache.org/job/cloudstack-marvin-41/ws/engine/service/pom.xml>
to /home/jenkins/jenkins-slave/maven-repositories/0/org/apache/cloudstack/cloud-engine-service/4.1.1-SNAPSHOT/cloud-engine-service-4.1.1-SNAPSHOT.pom
[INFO] ------------------------------------------------------------------------
[INFO] Reactor Summary:
[INFO] 
[INFO] Apache CloudStack ................................. SUCCESS [5.096s]
[INFO] Apache CloudStack Utils ........................... SUCCESS [12.319s]
[INFO] Apache CloudStack API ............................. SUCCESS [7.015s]
[INFO] Apache CloudStack Core ............................ SUCCESS [4.168s]
[INFO] Apache CloudStack Agents .......................... SUCCESS [4.197s]
[INFO] Apache CloudStack SystemVM Patches ................ SUCCESS [0.687s]
[INFO] Apache CloudStack Console Proxy ................... SUCCESS [6.413s]
[INFO] Apache CloudStack Framework ....................... SUCCESS [0.209s]
[INFO] Apache CloudStack Framework - IPC ................. SUCCESS [2.910s]
[INFO] Apache CloudStack Framework - REST ................ SUCCESS [3.769s]
[INFO] Apache CloudStack Cloud Engine .................... SUCCESS [0.211s]
[INFO] Apache CloudStack Cloud Engine API ................ SUCCESS [2.213s]
[INFO] Apache CloudStack Framework - Event Notification .. SUCCESS [1.517s]
[INFO] Apache CloudStack Server .......................... SUCCESS [14.746s]
[INFO] Apache CloudStack Usage Server .................... SUCCESS [3.444s]
[INFO] Apache XenSource XAPI ............................. SUCCESS [2.984s]
[INFO] Apache CloudStack Plugin POM ...................... SUCCESS [0.454s]
[INFO] Apache CloudStack Plugin - API Rate Limit ......... SUCCESS [5.763s]
[INFO] Apache CloudStack Plugin - API Discovery .......... SUCCESS [3.048s]
[INFO] Apache CloudStack Plugin - ACL Static Role Based .. SUCCESS [2.108s]
[INFO] Apache CloudStack Plugin - User Concentrated Pod Deployment Planner  SUCCESS [2.108s]
[INFO] Apache CloudStack Plugin - User Dispersing Deployment Planner  SUCCESS [1.961s]
[INFO] Apache CloudStack Plugin - Host Allocator Random .. SUCCESS [1.872s]
[INFO] Apache CloudStack Plugin - Hypervisor OracleVM .... SUCCESS [2.360s]
[INFO] Apache CloudStack Cloud Engine Internal Components API  SUCCESS [1.619s]
[INFO] Apache CloudStack Engine Storage Component ........ SUCCESS [2.663s]
[INFO] Apache CloudStack Plugin - Open vSwitch ........... SUCCESS [2.139s]
[INFO] Apache CloudStack Plugin - Hypervisor Xen ......... SUCCESS [3.035s]
[INFO] Apache CloudStack Plugin - Hypervisor KVM ......... SUCCESS [3.673s]
[INFO] Apache CloudStack Plugin - RabbitMQ Event Bus ..... SUCCESS [2.036s]
[INFO] Apache CloudStack Plugin - Hypervisor Simulator ... SUCCESS [2.480s]
[INFO] Apache CloudStack Plugin - Network Elastic Load Balancer  SUCCESS [2.077s]
[INFO] Apache CloudStack Plugin - Network Nicira NVP ..... SUCCESS [4.476s]
[INFO] Apache CloudStack Plugin - BigSwitch Virtual Network Segment  SUCCESS [3.713s]
[INFO] Apache CloudStack Plugin - Storage Allocator Random  SUCCESS [1.975s]
[INFO] Apache CloudStack Plugin - User Authenticator LDAP  SUCCESS [1.885s]
[INFO] Apache CloudStack Plugin - User Authenticator MD5 . SUCCESS [2.187s]
[INFO] Apache CloudStack Plugin - User Authenticator Plain Text  SUCCESS [1.999s]
[INFO] Apache CloudStack Plugin - User Authenticator SHA256 Salted  SUCCESS [3.081s]
[INFO] Apache CloudStack Plugin - Dns Notifier Example ... SUCCESS [1.875s]
[INFO] Apache CloudStack Engine Storage Image Component .. SUCCESS [1.976s]
[INFO] Apache CloudStack Plugin - Storage Image S3 ....... SUCCESS [1.242s]
[INFO] Apache CloudStack Engine Storage Volume Component . SUCCESS [2.699s]
[INFO] Apache CloudStack Plugin - Storage Volume solidfire  SUCCESS [2.473s]
[INFO] Apache CloudStack Cloud Engine Compute Component .. SUCCESS [1.793s]
[INFO] Apache CloudStack Cloud Engine API ................ SUCCESS [1.729s]
[INFO] Apache CloudStack Cloud Engine Orchestration Component  SUCCESS [2.848s]
[INFO] Apache CloudStack Cloud Engine Schema Component ... SUCCESS [1.229s]
[INFO] Apache CloudStack Engine Storage Backup Component . SUCCESS [1.853s]
[INFO] Apache CloudStack Engine Storage Image Motion Component  SUCCESS [2.113s]
[INFO] Apache CloudStack Engine Storage Snapshot Component  SUCCESS [2.101s]
[INFO] Apache CloudStack Client UI ....................... SUCCESS [6.439s]
[INFO] Apache CloudStack Test ............................ SUCCESS [2.465s]
[INFO] Apache CloudStack Engine Storage integration test Component  SUCCESS [2.134s]
[INFO] Apache CloudStack Cloud Engine Service ............ SUCCESS [4.817s]
[INFO] ------------------------------------------------------------------------
[INFO] BUILD SUCCESS
[INFO] ------------------------------------------------------------------------
[INFO] Total time: 2:56.458s
[INFO] Finished at: Sat Jun 22 08:45:46 UTC 2013
[INFO] Final Memory: 36M/186M
[INFO] ------------------------------------------------------------------------
[JENKINS] Archiving disabled
[JENKINS] Archiving disabled
[JENKINS] Archiving disabled
[JENKINS] Archiving disabled
[JENKINS] Archiving disabled
[JENKINS] Archiving disabled
[JENKINS] Archiving disabled
[JENKINS] Archiving disabled
[JENKINS] Archiving disabled
[JENKINS] Archiving disabled
[JENKINS] Archiving disabled
[JENKINS] Archiving disabled
[JENKINS] Archiving disabled
[JENKINS] Archiving disabled
[JENKINS] Archiving disabled
[JENKINS] Archiving disabled
[JENKINS] Archiving disabled
[JENKINS] Archiving disabled
[JENKINS] Archiving disabled
[JENKINS] Archiving disabled
[JENKINS] Archiving disabled
[JENKINS] Archiving disabled
[JENKINS] Archiving disabled
[JENKINS] Archiving disabled
[JENKINS] Archiving disabled
[JENKINS] Archiving disabled
[JENKINS] Archiving disabled
[JENKINS] Archiving disabled
[JENKINS] Archiving disabled
[JENKINS] Archiving disabled
[JENKINS] Archiving disabled
[JENKINS] Archiving disabled
[JENKINS] Archiving disabled
[JENKINS] Archiving disabled
[JENKINS] Archiving disabled
[JENKINS] Archiving disabled
[JENKINS] Archiving disabled
[JENKINS] Archiving disabled
[JENKINS] Archiving disabled
[JENKINS] Archiving disabled
[JENKINS] Archiving disabled
[JENKINS] Archiving disabled
[JENKINS] Archiving disabled
[JENKINS] Archiving disabled
[JENKINS] Archiving disabled
[JENKINS] Archiving disabled
[JENKINS] Archiving disabled
[JENKINS] Archiving disabled
[JENKINS] Archiving disabled
[JENKINS] Archiving disabled
[JENKINS] Archiving disabled
[JENKINS] Archiving disabled
[JENKINS] Archiving disabled
[JENKINS] Archiving disabled
[JENKINS] Archiving disabled
Waiting for Jenkins to finish collecting data
channel stopped
[cloudstack-marvin-41] $ /bin/bash -xe /tmp/hudson4880215240974648946.sh
+ mvn -P developer -pl :cloud-apidoc -pl :cloud-marvin
[INFO] Scanning for projects...
[INFO] ------------------------------------------------------------------------
[INFO] Reactor Build Order:
[INFO] 
[INFO] Apache CloudStack apidoc Tools
[INFO] Apache CloudStack Developer Tools: marvin
[INFO]                                                                         
[INFO] ------------------------------------------------------------------------
[INFO] Building Apache CloudStack apidoc Tools 4.1.1-SNAPSHOT
[INFO] ------------------------------------------------------------------------
Downloading: http://repository.apache.org/snapshots/org/apache/cloudstack/cloud-client-ui/4.1.1-SNAPSHOT/maven-metadata.xml

Downloading: http://repository.apache.org/snapshots/org/apache/cloudstack/cloud-client-ui/4.1.1-SNAPSHOT/cloud-client-ui-4.1.1-SNAPSHOT.war

[INFO] ------------------------------------------------------------------------
[INFO] Reactor Summary:
[INFO] 
[INFO] Apache CloudStack apidoc Tools .................... FAILURE [1.523s]
[INFO] Apache CloudStack Developer Tools: marvin ......... SKIPPED
[INFO] ------------------------------------------------------------------------
[INFO] BUILD FAILURE
[INFO] ------------------------------------------------------------------------
[INFO] Total time: 2.565s
[INFO] Finished at: Sat Jun 22 08:46:15 UTC 2013
[INFO] Final Memory: 12M/109M
[INFO] ------------------------------------------------------------------------
[ERROR] Failed to execute goal on project cloud-apidoc: Could not resolve dependencies for
project org.apache.cloudstack:cloud-apidoc:pom:4.1.1-SNAPSHOT: Could not find artifact org.apache.cloudstack:cloud-client-ui:war:4.1.1-SNAPSHOT
in Nexus (http://repository.apache.org/snapshots) -> [Help 1]
[ERROR] 
[ERROR] To see the full stack trace of the errors, re-run Maven with the -e switch.
[ERROR] Re-run Maven using the -X switch to enable full debug logging.
[ERROR] 
[ERROR] For more information about the errors and possible solutions, please read the following
articles:
[ERROR] [Help 1] http://cwiki.apache.org/confluence/display/MAVEN/DependencyResolutionException
Build step 'Execute shell' marked build as failure
Archiving artifacts

Mime
View raw message