cloudstack-commits mailing list archives

Site index · List index
Message view « Date » · « Thread »
Top « Date » · « Thread »
From Apache Jenkins Server <jenk...@builds.apache.org>
Subject Build failed in Jenkins: cloudstack-marvin-41 #480
Date Thu, 27 Jun 2013 00:00:49 GMT
See <https://builds.apache.org/job/cloudstack-marvin-41/480/>

------------------------------------------
[...truncated 3075 lines...]
[INFO] [INFO] Using 'UTF-8' encoding to copy filtered resources.
[INFO] skip non existing resourceDirectory <https://builds.apache.org/job/cloudstack-marvin-41/ws/engine/storage/integration-test/src/main/resources>
[INFO] Copying 3 resources

[INFO] --- maven-resources-plugin:2.5:resources (default-resources) @ cloud-engine-storage-integration-test
---
[INFO] [INFO] No sources to compile

[INFO] --- maven-compiler-plugin:2.5.1:compile (default-compile) @ cloud-engine-storage-integration-test
---
[debug] execute contextualize
[INFO] Using 'UTF-8' encoding to copy filtered resources.
[INFO] Copying 2 resources
[INFO] [INFO] Copying 3 resources

[INFO] --- maven-resources-plugin:2.5:testResources (default-testResources) @ cloud-engine-storage-integration-test
---
[INFO] Compiling 18 source files to <https://builds.apache.org/job/cloudstack-marvin-41/ws/engine/storage/integration-test/target/test-classes>
[INFO] 
[INFO] --- maven-compiler-plugin:2.5.1:testCompile (default-testCompile) @ cloud-engine-storage-integration-test
---
[INFO] 
[INFO] [INFO] Nothing to compile - all classes are up to date
--- maven-compiler-plugin:2.5.1:testCompile (default) @ cloud-engine-storage-integration-test
---
[INFO] [INFO] Tests are skipped.

[INFO] --- maven-surefire-plugin:2.12:test (default-test) @ cloud-engine-storage-integration-test
---
[INFO] 
[INFO] --- maven-jar-plugin:2.4:jar (default-jar) @ cloud-engine-storage-integration-test
---
[INFO] Building jar: <https://builds.apache.org/job/cloudstack-marvin-41/ws/engine/storage/integration-test/target/cloud-engine-storage-integration-test-4.1.1-SNAPSHOT.jar>
[INFO] 
[INFO] --- maven-site-plugin:3.1:attach-descriptor (attach-descriptor) @ cloud-engine-storage-integration-test
---
[INFO] [INFO] Tests are skipped.

[INFO] --- maven-surefire-plugin:2.12:test (default) @ cloud-engine-storage-integration-test
---
[INFO] [INFO] Installing <https://builds.apache.org/job/cloudstack-marvin-41/ws/engine/storage/integration-test/target/cloud-engine-storage-integration-test-4.1.1-SNAPSHOT.jar>
to /home/jenkins/jenkins-slave/maven-repositories/0/org/apache/cloudstack/cloud-engine-storage-integration-test/4.1.1-SNAPSHOT/cloud-engine-storage-integration-test-4.1.1-SNAPSHOT.jar

[INFO] --- maven-install-plugin:2.3.1:install (default-install) @ cloud-engine-storage-integration-test
---
[INFO] Installing <https://builds.apache.org/job/cloudstack-marvin-41/ws/engine/storage/integration-test/pom.xml>
to /home/jenkins/jenkins-slave/maven-repositories/0/org/apache/cloudstack/cloud-engine-storage-integration-test/4.1.1-SNAPSHOT/cloud-engine-storage-integration-test-4.1.1-SNAPSHOT.pom
[INFO]                                                                         
[INFO] ------------------------------------------------------------------------
[INFO] Building Apache CloudStack Cloud Engine Service 4.1.1-SNAPSHOT
[INFO] ------------------------------------------------------------------------
[INFO] Deleting <https://builds.apache.org/job/cloudstack-marvin-41/ws/engine/service/target>
[INFO] 
[INFO] --- maven-clean-plugin:2.5:clean (default-clean) @ cloud-engine-service ---
[INFO] 
[INFO] --- maven-remote-resources-plugin:1.3:process (default) @ cloud-engine-service ---
[debug] execute contextualize
[INFO] [INFO] Using 'UTF-8' encoding to copy filtered resources.
[INFO] skip non existing resourceDirectory <https://builds.apache.org/job/cloudstack-marvin-41/ws/engine/service/src/main/resources>
[INFO] Copying 3 resources

[INFO] --- maven-resources-plugin:2.5:resources (default-resources) @ cloud-engine-service
---
[INFO] [INFO] Nothing to compile - all classes are up to date

[INFO] --- maven-compiler-plugin:2.5.1:compile (default-compile) @ cloud-engine-service ---
[debug] execute contextualize
[INFO] [INFO] Using 'UTF-8' encoding to copy filtered resources.
[INFO] skip non existing resourceDirectory <https://builds.apache.org/job/cloudstack-marvin-41/ws/engine/service/src/test/resources>
[INFO] Copying 3 resources

[INFO] --- maven-resources-plugin:2.5:testResources (default-testResources) @ cloud-engine-service
---
[INFO] [INFO] No sources to compile

[INFO] --- maven-compiler-plugin:2.5.1:testCompile (default-testCompile) @ cloud-engine-service
---
[INFO] [INFO] Surefire report directory: <https://builds.apache.org/job/cloudstack-marvin-41/ws/engine/service/target/surefire-reports>

[INFO] --- maven-surefire-plugin:2.12:test (default-test) @ cloud-engine-service ---

-------------------------------------------------------
 T E S T S
-------------------------------------------------------

Results :

Tests run: 0, Failures: 0, Errors: 0, Skipped: 0

[JENKINS] Recording test results
[INFO] 
[INFO] --- maven-war-plugin:2.1.1:war (default-war) @ cloud-engine-service ---
[INFO] Packaging webapp
[INFO] Assembling webapp [cloud-engine-service] in [<https://builds.apache.org/job/cloudstack-marvin-41/ws/engine/service/target/engine]>
[INFO] Processing war project
[INFO] Copying webapp resources [<https://builds.apache.org/job/cloudstack-marvin-41/ws/engine/service/src/main/webapp]>
[INFO] Webapp assembled in [139 msecs]
[INFO] Building war: <https://builds.apache.org/job/cloudstack-marvin-41/ws/engine/service/target/engine.war>
[INFO] WEB-INF/web.xml already added, skipping
[INFO] 
[INFO] --- maven-site-plugin:3.1:attach-descriptor (attach-descriptor) @ cloud-engine-service
---
[INFO] [INFO] Installing <https://builds.apache.org/job/cloudstack-marvin-41/ws/engine/service/target/engine.war>
to /home/jenkins/jenkins-slave/maven-repositories/0/org/apache/cloudstack/cloud-engine-service/4.1.1-SNAPSHOT/cloud-engine-service-4.1.1-SNAPSHOT.war

[INFO] --- maven-install-plugin:2.3.1:install (default-install) @ cloud-engine-service ---
[INFO] Installing <https://builds.apache.org/job/cloudstack-marvin-41/ws/engine/service/pom.xml>
to /home/jenkins/jenkins-slave/maven-repositories/0/org/apache/cloudstack/cloud-engine-service/4.1.1-SNAPSHOT/cloud-engine-service-4.1.1-SNAPSHOT.pom
[INFO] ------------------------------------------------------------------------
[INFO] Reactor Summary:
[INFO] 
[INFO] Apache CloudStack ................................. SUCCESS [6.936s]
[INFO] Apache CloudStack Utils ........................... SUCCESS [13.924s]
[INFO] Apache CloudStack API ............................. SUCCESS [6.872s]
[INFO] Apache CloudStack Core ............................ SUCCESS [3.553s]
[INFO] Apache CloudStack Agents .......................... SUCCESS [4.691s]
[INFO] Apache CloudStack SystemVM Patches ................ SUCCESS [0.703s]
[INFO] Apache CloudStack Console Proxy ................... SUCCESS [6.727s]
[INFO] Apache CloudStack Framework ....................... SUCCESS [0.225s]
[INFO] Apache CloudStack Framework - IPC ................. SUCCESS [2.633s]
[INFO] Apache CloudStack Framework - REST ................ SUCCESS [2.724s]
[INFO] Apache CloudStack Cloud Engine .................... SUCCESS [0.239s]
[INFO] Apache CloudStack Cloud Engine API ................ SUCCESS [2.035s]
[INFO] Apache CloudStack Framework - Event Notification .. SUCCESS [1.620s]
[INFO] Apache CloudStack Server .......................... SUCCESS [14.804s]
[INFO] Apache CloudStack Usage Server .................... SUCCESS [3.392s]
[INFO] Apache XenSource XAPI ............................. SUCCESS [2.677s]
[INFO] Apache CloudStack Plugin POM ...................... SUCCESS [0.458s]
[INFO] Apache CloudStack Plugin - API Rate Limit ......... SUCCESS [4.203s]
[INFO] Apache CloudStack Plugin - API Discovery .......... SUCCESS [2.868s]
[INFO] Apache CloudStack Plugin - ACL Static Role Based .. SUCCESS [1.917s]
[INFO] Apache CloudStack Plugin - User Concentrated Pod Deployment Planner  SUCCESS [2.032s]
[INFO] Apache CloudStack Plugin - User Dispersing Deployment Planner  SUCCESS [2.166s]
[INFO] Apache CloudStack Plugin - Host Allocator Random .. SUCCESS [2.050s]
[INFO] Apache CloudStack Plugin - Hypervisor OracleVM .... SUCCESS [2.323s]
[INFO] Apache CloudStack Cloud Engine Internal Components API  SUCCESS [1.852s]
[INFO] Apache CloudStack Engine Storage Component ........ SUCCESS [2.677s]
[INFO] Apache CloudStack Plugin - Open vSwitch ........... SUCCESS [2.798s]
[INFO] Apache CloudStack Plugin - Hypervisor Xen ......... SUCCESS [3.235s]
[INFO] Apache CloudStack Plugin - Hypervisor KVM ......... SUCCESS [3.468s]
[INFO] Apache CloudStack Plugin - RabbitMQ Event Bus ..... SUCCESS [1.854s]
[INFO] Apache CloudStack Plugin - Hypervisor Simulator ... SUCCESS [2.862s]
[INFO] Apache CloudStack Plugin - Network Elastic Load Balancer  SUCCESS [2.131s]
[INFO] Apache CloudStack Plugin - Network Nicira NVP ..... SUCCESS [4.778s]
[INFO] Apache CloudStack Plugin - BigSwitch Virtual Network Segment  SUCCESS [3.711s]
[INFO] Apache CloudStack Plugin - Storage Allocator Random  SUCCESS [1.684s]
[INFO] Apache CloudStack Plugin - User Authenticator LDAP  SUCCESS [1.816s]
[INFO] Apache CloudStack Plugin - User Authenticator MD5 . SUCCESS [1.762s]
[INFO] Apache CloudStack Plugin - User Authenticator Plain Text  SUCCESS [1.976s]
[INFO] Apache CloudStack Plugin - User Authenticator SHA256 Salted  SUCCESS [3.875s]
[INFO] Apache CloudStack Plugin - Dns Notifier Example ... SUCCESS [1.842s]
[INFO] Apache CloudStack Engine Storage Image Component .. SUCCESS [1.982s]
[INFO] Apache CloudStack Plugin - Storage Image S3 ....... SUCCESS [1.348s]
[INFO] Apache CloudStack Engine Storage Volume Component . SUCCESS [2.508s]
[INFO] Apache CloudStack Plugin - Storage Volume solidfire  SUCCESS [2.394s]
[INFO] Apache CloudStack Cloud Engine Compute Component .. SUCCESS [1.833s]
[INFO] Apache CloudStack Cloud Engine API ................ SUCCESS [1.825s]
[INFO] Apache CloudStack Cloud Engine Orchestration Component  SUCCESS [3.081s]
[INFO] Apache CloudStack Cloud Engine Schema Component ... SUCCESS [1.168s]
[INFO] Apache CloudStack Engine Storage Backup Component . SUCCESS [1.815s]
[INFO] Apache CloudStack Engine Storage Image Motion Component  SUCCESS [2.117s]
[INFO] Apache CloudStack Engine Storage Snapshot Component  SUCCESS [2.036s]
[INFO] Apache CloudStack Client UI ....................... SUCCESS [7.514s]
[INFO] Apache CloudStack Test ............................ SUCCESS [2.999s]
[INFO] Apache CloudStack Engine Storage integration test Component  SUCCESS [2.508s]
[INFO] Apache CloudStack Cloud Engine Service ............ SUCCESS [5.151s]
[INFO] ------------------------------------------------------------------------
[INFO] BUILD SUCCESS
[INFO] ------------------------------------------------------------------------
[INFO] Total time: 2:57.478s
[INFO] Finished at: Thu Jun 27 00:00:19 UTC 2013
[INFO] Final Memory: 39M/218M
[INFO] ------------------------------------------------------------------------
[JENKINS] Archiving disabled
[JENKINS] Archiving disabled
[JENKINS] Archiving disabled
[JENKINS] Archiving disabled
[JENKINS] Archiving disabled
[JENKINS] Archiving disabled
[JENKINS] Archiving disabled
[JENKINS] Archiving disabled
[JENKINS] Archiving disabled
[JENKINS] Archiving disabled
[JENKINS] Archiving disabled
[JENKINS] Archiving disabled
[JENKINS] Archiving disabled
[JENKINS] Archiving disabled
[JENKINS] Archiving disabled
[JENKINS] Archiving disabled
[JENKINS] Archiving disabled
[JENKINS] Archiving disabled
[JENKINS] Archiving disabled
[JENKINS] Archiving disabled
[JENKINS] Archiving disabled
[JENKINS] Archiving disabled
[JENKINS] Archiving disabled
[JENKINS] Archiving disabled
[JENKINS] Archiving disabled
[JENKINS] Archiving disabled
[JENKINS] Archiving disabled
[JENKINS] Archiving disabled
[JENKINS] Archiving disabled
[JENKINS] Archiving disabled
[JENKINS] Archiving disabled
[JENKINS] Archiving disabled
[JENKINS] Archiving disabled
[JENKINS] Archiving disabled
[JENKINS] Archiving disabled
[JENKINS] Archiving disabled
[JENKINS] Archiving disabled
[JENKINS] Archiving disabled
[JENKINS] Archiving disabled
[JENKINS] Archiving disabled
[JENKINS] Archiving disabled
[JENKINS] Archiving disabled
[JENKINS] Archiving disabled
[JENKINS] Archiving disabled
[JENKINS] Archiving disabled
[JENKINS] Archiving disabled
[JENKINS] Archiving disabled
[JENKINS] Archiving disabled
[JENKINS] Archiving disabled
[JENKINS] Archiving disabled
[JENKINS] Archiving disabled
[JENKINS] Archiving disabled
[JENKINS] Archiving disabled
[JENKINS] Archiving disabled
[JENKINS] Archiving disabled
Waiting for Jenkins to finish collecting data
channel stopped
[cloudstack-marvin-41] $ /bin/bash -xe /tmp/hudson7165271153997188956.sh
+ mvn -P developer -pl :cloud-apidoc -pl :cloud-marvin
[INFO] Scanning for projects...
[INFO] ------------------------------------------------------------------------
[INFO] Reactor Build Order:
[INFO] 
[INFO] Apache CloudStack apidoc Tools
[INFO] Apache CloudStack Developer Tools: marvin
[INFO]                                                                         
[INFO] ------------------------------------------------------------------------
[INFO] Building Apache CloudStack apidoc Tools 4.1.1-SNAPSHOT
[INFO] ------------------------------------------------------------------------
Downloading: http://repository.apache.org/snapshots/org/apache/cloudstack/cloud-client-ui/4.1.1-SNAPSHOT/maven-metadata.xml

Downloading: http://repository.apache.org/snapshots/org/apache/cloudstack/cloud-client-ui/4.1.1-SNAPSHOT/cloud-client-ui-4.1.1-SNAPSHOT.war

[INFO] ------------------------------------------------------------------------
[INFO] Reactor Summary:
[INFO] 
[INFO] Apache CloudStack apidoc Tools .................... FAILURE [1.116s]
[INFO] Apache CloudStack Developer Tools: marvin ......... SKIPPED
[INFO] ------------------------------------------------------------------------
[INFO] BUILD FAILURE
[INFO] ------------------------------------------------------------------------
[INFO] Total time: 2.059s
[INFO] Finished at: Thu Jun 27 00:00:47 UTC 2013
[INFO] Final Memory: 12M/79M
[INFO] ------------------------------------------------------------------------
[ERROR] Failed to execute goal on project cloud-apidoc: Could not resolve dependencies for
project org.apache.cloudstack:cloud-apidoc:pom:4.1.1-SNAPSHOT: Could not find artifact org.apache.cloudstack:cloud-client-ui:war:4.1.1-SNAPSHOT
in Nexus (http://repository.apache.org/snapshots) -> [Help 1]
[ERROR] 
[ERROR] To see the full stack trace of the errors, re-run Maven with the -e switch.
[ERROR] Re-run Maven using the -X switch to enable full debug logging.
[ERROR] 
[ERROR] For more information about the errors and possible solutions, please read the following
articles:
[ERROR] [Help 1] http://cwiki.apache.org/confluence/display/MAVEN/DependencyResolutionException
Build step 'Execute shell' marked build as failure
Archiving artifacts

Mime
View raw message