cloudstack-commits mailing list archives

Site index · List index
Message view « Date » · « Thread »
Top « Date » · « Thread »
From Apache Jenkins Server <jenk...@builds.apache.org>
Subject Build failed in Jenkins: cloudstack-rat-41 #502
Date Sun, 16 Jun 2013 16:31:26 GMT
See <https://builds.apache.org/job/cloudstack-rat-41/502/>

------------------------------------------
Started by an SCM change
Building remotely on ubuntu6 in workspace <https://builds.apache.org/job/cloudstack-rat-41/ws/>
Checkout:cloudstack-rat-41 / <https://builds.apache.org/job/cloudstack-rat-41/ws/> -
hudson.remoting.Channel@6afd850f:ubuntu6
Using strategy: Default
Last Built Revision: Revision 3bd8f7e6d5d2d08113b812363038b2616016b9cf (origin/4.1)
Fetching changes from 1 remote Git repository
Fetching upstream changes from https://git-wip-us.apache.org/repos/asf/cloudstack.git
Commencing build of Revision 3bd8f7e6d5d2d08113b812363038b2616016b9cf (origin/4.1)
Checking out Revision 3bd8f7e6d5d2d08113b812363038b2616016b9cf (origin/4.1)
[cloudstack-rat-41] $ /bin/bash -xe /tmp/hudson5930301643639075735.sh
+ /home/jenkins/tools/maven/latest2/bin/mvn --projects=org.apache.cloudstack:cloudstack org.apache.rat:apache-rat-plugin:0.8:check
[INFO] Scanning for projects...
[INFO] ------------------------------------------------------------------------
[ERROR] FATAL ERROR
[INFO] ------------------------------------------------------------------------
[INFO] Error building POM (may not be this project's POM).


Project ID: unknown:xapi

Reason: Missing version element from parent element for project unknown:xapi


[INFO] ------------------------------------------------------------------------
[INFO] Trace
org.apache.maven.reactor.MavenExecutionException: Missing version element from parent element
for project unknown:xapi
	at org.apache.maven.DefaultMaven.getProjects(DefaultMaven.java:404)
	at org.apache.maven.DefaultMaven.doExecute(DefaultMaven.java:272)
	at org.apache.maven.DefaultMaven.execute(DefaultMaven.java:138)
	at org.apache.maven.cli.MavenCli.main(MavenCli.java:362)
	at org.apache.maven.cli.compat.CompatibleMain.main(CompatibleMain.java:60)
	at sun.reflect.NativeMethodAccessorImpl.invoke0(Native Method)
	at sun.reflect.NativeMethodAccessorImpl.invoke(NativeMethodAccessorImpl.java:39)
	at sun.reflect.DelegatingMethodAccessorImpl.invoke(DelegatingMethodAccessorImpl.java:25)
	at java.lang.reflect.Method.invoke(Method.java:597)
	at org.codehaus.classworlds.Launcher.launchEnhanced(Launcher.java:315)
	at org.codehaus.classworlds.Launcher.launch(Launcher.java:255)
	at org.codehaus.classworlds.Launcher.mainWithExitCode(Launcher.java:430)
	at org.codehaus.classworlds.Launcher.main(Launcher.java:375)
Caused by: org.apache.maven.project.ProjectBuildingException: Missing version element from
parent element for project unknown:xapi
	at org.apache.maven.project.DefaultMavenProjectBuilder.assembleLineage(DefaultMavenProjectBuilder.java:1249)
	at org.apache.maven.project.DefaultMavenProjectBuilder.buildInternal(DefaultMavenProjectBuilder.java:823)
	at org.apache.maven.project.DefaultMavenProjectBuilder.buildFromSourceFileInternal(DefaultMavenProjectBuilder.java:508)
	at org.apache.maven.project.DefaultMavenProjectBuilder.build(DefaultMavenProjectBuilder.java:200)
	at org.apache.maven.DefaultMaven.getProject(DefaultMaven.java:604)
	at org.apache.maven.DefaultMaven.collectProjects(DefaultMaven.java:487)
	at org.apache.maven.DefaultMaven.collectProjects(DefaultMaven.java:560)
	at org.apache.maven.DefaultMaven.getProjects(DefaultMaven.java:391)
	... 12 more
[INFO] ------------------------------------------------------------------------
[INFO] Total time: < 1 second
[INFO] Finished at: Sun Jun 16 16:31:22 UTC 2013
[INFO] Final Memory: 2M/61M
[INFO] ------------------------------------------------------------------------
Build step 'Execute shell' marked build as failure
Archiving artifacts

Mime
View raw message