cloudstack-commits mailing list archives

Site index · List index
Message view « Date » · « Thread »
Top « Date » · « Thread »
From Apache Jenkins Server <jenk...@builds.apache.org>
Subject Build failed in Jenkins: cloudstack-marvin-41 #457
Date Sun, 23 Jun 2013 19:16:35 GMT
See <https://builds.apache.org/job/cloudstack-marvin-41/457/changes>

Changes:

[jzb] Adding instructions for restarting MySQL on Debian/Ubuntu systems, since the name of
the service differs. Found during Hack Day.

[jzb] Fixing typo in build-deb.xml

------------------------------------------
[...truncated 3077 lines...]
[INFO] Using 'UTF-8' encoding to copy filtered resources.
[INFO] skip non existing resourceDirectory <https://builds.apache.org/job/cloudstack-marvin-41/ws/engine/storage/integration-test/src/main/resources>
[INFO] Copying 3 resources

[INFO] --- maven-resources-plugin:2.5:resources (default-resources) @ cloud-engine-storage-integration-test
---
[INFO] [INFO] No sources to compile

[INFO] --- maven-compiler-plugin:2.5.1:compile (default-compile) @ cloud-engine-storage-integration-test
---
[debug] execute contextualize
[INFO] [INFO] Using 'UTF-8' encoding to copy filtered resources.
[INFO] Copying 2 resources
[INFO] Copying 3 resources

[INFO] --- maven-resources-plugin:2.5:testResources (default-testResources) @ cloud-engine-storage-integration-test
---
[INFO] Compiling 18 source files to <https://builds.apache.org/job/cloudstack-marvin-41/ws/engine/storage/integration-test/target/test-classes>
[INFO] 
[INFO] --- maven-compiler-plugin:2.5.1:testCompile (default-testCompile) @ cloud-engine-storage-integration-test
---
[INFO] Nothing to compile - all classes are up to date
[INFO] 
[INFO] --- maven-compiler-plugin:2.5.1:testCompile (default) @ cloud-engine-storage-integration-test
---
[INFO] [INFO] Tests are skipped.

[INFO] --- maven-surefire-plugin:2.12:test (default-test) @ cloud-engine-storage-integration-test
---
[INFO] [INFO] Building jar: <https://builds.apache.org/job/cloudstack-marvin-41/ws/engine/storage/integration-test/target/cloud-engine-storage-integration-test-4.1.1-SNAPSHOT.jar>

[INFO] --- maven-jar-plugin:2.4:jar (default-jar) @ cloud-engine-storage-integration-test
---
[INFO] 
[INFO] --- maven-site-plugin:3.1:attach-descriptor (attach-descriptor) @ cloud-engine-storage-integration-test
---
[INFO] [INFO] Tests are skipped.

[INFO] --- maven-surefire-plugin:2.12:test (default) @ cloud-engine-storage-integration-test
---
[INFO] [INFO] Installing <https://builds.apache.org/job/cloudstack-marvin-41/ws/engine/storage/integration-test/target/cloud-engine-storage-integration-test-4.1.1-SNAPSHOT.jar>
to /home/jenkins/jenkins-slave/maven-repositories/0/org/apache/cloudstack/cloud-engine-storage-integration-test/4.1.1-SNAPSHOT/cloud-engine-storage-integration-test-4.1.1-SNAPSHOT.jar

[INFO] --- maven-install-plugin:2.3.1:install (default-install) @ cloud-engine-storage-integration-test
---
[INFO] Installing <https://builds.apache.org/job/cloudstack-marvin-41/ws/engine/storage/integration-test/pom.xml>
to /home/jenkins/jenkins-slave/maven-repositories/0/org/apache/cloudstack/cloud-engine-storage-integration-test/4.1.1-SNAPSHOT/cloud-engine-storage-integration-test-4.1.1-SNAPSHOT.pom
[INFO] [INFO] Deleting <https://builds.apache.org/job/cloudstack-marvin-41/ws/engine/service/target>
                                                                        
[INFO] ------------------------------------------------------------------------
[INFO] Building Apache CloudStack Cloud Engine Service 4.1.1-SNAPSHOT
[INFO] ------------------------------------------------------------------------
[INFO] 
[INFO] --- maven-clean-plugin:2.5:clean (default-clean) @ cloud-engine-service ---
[INFO] 
[INFO] --- maven-remote-resources-plugin:1.3:process (default) @ cloud-engine-service ---
[debug] execute contextualize
[INFO] [INFO] Using 'UTF-8' encoding to copy filtered resources.
[INFO] skip non existing resourceDirectory <https://builds.apache.org/job/cloudstack-marvin-41/ws/engine/service/src/main/resources>
[INFO] Copying 3 resources

[INFO] --- maven-resources-plugin:2.5:resources (default-resources) @ cloud-engine-service
---
[INFO] [INFO] Nothing to compile - all classes are up to date

[INFO] --- maven-compiler-plugin:2.5.1:compile (default-compile) @ cloud-engine-service ---
[debug] execute contextualize
[INFO] [INFO] Using 'UTF-8' encoding to copy filtered resources.
[INFO] skip non existing resourceDirectory <https://builds.apache.org/job/cloudstack-marvin-41/ws/engine/service/src/test/resources>
[INFO] Copying 3 resources

[INFO] --- maven-resources-plugin:2.5:testResources (default-testResources) @ cloud-engine-service
---
[INFO] No sources to compile
[INFO] 
[INFO] --- maven-compiler-plugin:2.5.1:testCompile (default-testCompile) @ cloud-engine-service
---
[INFO] [INFO] Surefire report directory: <https://builds.apache.org/job/cloudstack-marvin-41/ws/engine/service/target/surefire-reports>

-------------------------------------------------------
 T E S T S
-------------------------------------------------------

[INFO] --- maven-surefire-plugin:2.12:test (default-test) @ cloud-engine-service ---

Results :

Tests run: 0, Failures: 0, Errors: 0, Skipped: 0

[JENKINS] Recording test results
[INFO] 
[INFO] --- maven-war-plugin:2.1.1:war (default-war) @ cloud-engine-service ---
[INFO] Packaging webapp
[INFO] Assembling webapp [cloud-engine-service] in [<https://builds.apache.org/job/cloudstack-marvin-41/ws/engine/service/target/engine]>
[INFO] Processing war project
[INFO] Copying webapp resources [<https://builds.apache.org/job/cloudstack-marvin-41/ws/engine/service/src/main/webapp]>
[INFO] Webapp assembled in [228 msecs]
[INFO] Building war: <https://builds.apache.org/job/cloudstack-marvin-41/ws/engine/service/target/engine.war>
[INFO] WEB-INF/web.xml already added, skipping
[INFO] 
[INFO] --- maven-site-plugin:3.1:attach-descriptor (attach-descriptor) @ cloud-engine-service
---
[INFO] [INFO] Installing <https://builds.apache.org/job/cloudstack-marvin-41/ws/engine/service/target/engine.war>
to /home/jenkins/jenkins-slave/maven-repositories/0/org/apache/cloudstack/cloud-engine-service/4.1.1-SNAPSHOT/cloud-engine-service-4.1.1-SNAPSHOT.war

[INFO] --- maven-install-plugin:2.3.1:install (default-install) @ cloud-engine-service ---
[INFO] Installing <https://builds.apache.org/job/cloudstack-marvin-41/ws/engine/service/pom.xml>
to /home/jenkins/jenkins-slave/maven-repositories/0/org/apache/cloudstack/cloud-engine-service/4.1.1-SNAPSHOT/cloud-engine-service-4.1.1-SNAPSHOT.pom
[INFO] ------------------------------------------------------------------------
[INFO] Reactor Summary:
[INFO] 
[INFO] Apache CloudStack ................................. SUCCESS [21.832s]
[INFO] Apache CloudStack Utils ........................... SUCCESS [19.538s]
[INFO] Apache CloudStack API ............................. SUCCESS [10.386s]
[INFO] Apache CloudStack Core ............................ SUCCESS [5.486s]
[INFO] Apache CloudStack Agents .......................... SUCCESS [6.461s]
[INFO] Apache CloudStack SystemVM Patches ................ SUCCESS [1.274s]
[INFO] Apache CloudStack Console Proxy ................... SUCCESS [10.282s]
[INFO] Apache CloudStack Framework ....................... SUCCESS [0.964s]
[INFO] Apache CloudStack Framework - IPC ................. SUCCESS [4.669s]
[INFO] Apache CloudStack Framework - REST ................ SUCCESS [3.937s]
[INFO] Apache CloudStack Cloud Engine .................... SUCCESS [0.670s]
[INFO] Apache CloudStack Cloud Engine API ................ SUCCESS [3.287s]
[INFO] Apache CloudStack Framework - Event Notification .. SUCCESS [2.384s]
[INFO] Apache CloudStack Server .......................... SUCCESS [19.597s]
[INFO] Apache CloudStack Usage Server .................... SUCCESS [5.612s]
[INFO] Apache XenSource XAPI ............................. SUCCESS [4.494s]
[INFO] Apache CloudStack Plugin POM ...................... SUCCESS [0.897s]
[INFO] Apache CloudStack Plugin - API Rate Limit ......... SUCCESS [6.008s]
[INFO] Apache CloudStack Plugin - API Discovery .......... SUCCESS [4.393s]
[INFO] Apache CloudStack Plugin - ACL Static Role Based .. SUCCESS [3.195s]
[INFO] Apache CloudStack Plugin - User Concentrated Pod Deployment Planner  SUCCESS [4.059s]
[INFO] Apache CloudStack Plugin - User Dispersing Deployment Planner  SUCCESS [3.552s]
[INFO] Apache CloudStack Plugin - Host Allocator Random .. SUCCESS [3.312s]
[INFO] Apache CloudStack Plugin - Hypervisor OracleVM .... SUCCESS [3.371s]
[INFO] Apache CloudStack Cloud Engine Internal Components API  SUCCESS [3.179s]
[INFO] Apache CloudStack Engine Storage Component ........ SUCCESS [4.174s]
[INFO] Apache CloudStack Plugin - Open vSwitch ........... SUCCESS [3.312s]
[INFO] Apache CloudStack Plugin - Hypervisor Xen ......... SUCCESS [4.283s]
[INFO] Apache CloudStack Plugin - Hypervisor KVM ......... SUCCESS [6.273s]
[INFO] Apache CloudStack Plugin - RabbitMQ Event Bus ..... SUCCESS [4.240s]
[INFO] Apache CloudStack Plugin - Hypervisor Simulator ... SUCCESS [3.925s]
[INFO] Apache CloudStack Plugin - Network Elastic Load Balancer  SUCCESS [3.304s]
[INFO] Apache CloudStack Plugin - Network Nicira NVP ..... SUCCESS [6.873s]
[INFO] Apache CloudStack Plugin - BigSwitch Virtual Network Segment  SUCCESS [5.472s]
[INFO] Apache CloudStack Plugin - Storage Allocator Random  SUCCESS [2.788s]
[INFO] Apache CloudStack Plugin - User Authenticator LDAP  SUCCESS [3.192s]
[INFO] Apache CloudStack Plugin - User Authenticator MD5 . SUCCESS [3.148s]
[INFO] Apache CloudStack Plugin - User Authenticator Plain Text  SUCCESS [4.070s]
[INFO] Apache CloudStack Plugin - User Authenticator SHA256 Salted  SUCCESS [4.250s]
[INFO] Apache CloudStack Plugin - Dns Notifier Example ... SUCCESS [3.002s]
[INFO] Apache CloudStack Engine Storage Image Component .. SUCCESS [3.049s]
[INFO] Apache CloudStack Plugin - Storage Image S3 ....... SUCCESS [1.996s]
[INFO] Apache CloudStack Engine Storage Volume Component . SUCCESS [4.330s]
[INFO] Apache CloudStack Plugin - Storage Volume solidfire  SUCCESS [3.835s]
[INFO] Apache CloudStack Cloud Engine Compute Component .. SUCCESS [3.081s]
[INFO] Apache CloudStack Cloud Engine API ................ SUCCESS [3.057s]
[INFO] Apache CloudStack Cloud Engine Orchestration Component  SUCCESS [5.100s]
[INFO] Apache CloudStack Cloud Engine Schema Component ... SUCCESS [2.095s]
[INFO] Apache CloudStack Engine Storage Backup Component . SUCCESS [2.828s]
[INFO] Apache CloudStack Engine Storage Image Motion Component  SUCCESS [3.154s]
[INFO] Apache CloudStack Engine Storage Snapshot Component  SUCCESS [3.194s]
[INFO] Apache CloudStack Client UI ....................... SUCCESS [13.755s]
[INFO] Apache CloudStack Test ............................ SUCCESS [5.125s]
[INFO] Apache CloudStack Engine Storage integration test Component  SUCCESS [4.729s]
[INFO] Apache CloudStack Cloud Engine Service ............ SUCCESS [8.429s]
[INFO] ------------------------------------------------------------------------
[INFO] BUILD SUCCESS
[INFO] ------------------------------------------------------------------------
[INFO] Total time: 4:53.579s
[INFO] Finished at: Sun Jun 23 19:15:58 UTC 2013
[INFO] Final Memory: 35M/141M
[INFO] ------------------------------------------------------------------------
[JENKINS] Archiving disabled
[JENKINS] Archiving disabled
[JENKINS] Archiving disabled
[JENKINS] Archiving disabled
[JENKINS] Archiving disabled
[JENKINS] Archiving disabled
[JENKINS] Archiving disabled
[JENKINS] Archiving disabled
[JENKINS] Archiving disabled
[JENKINS] Archiving disabled
[JENKINS] Archiving disabled
[JENKINS] Archiving disabled
[JENKINS] Archiving disabled
[JENKINS] Archiving disabled
[JENKINS] Archiving disabled
[JENKINS] Archiving disabled
[JENKINS] Archiving disabled
[JENKINS] Archiving disabled
[JENKINS] Archiving disabled
[JENKINS] Archiving disabled
[JENKINS] Archiving disabled
[JENKINS] Archiving disabled
[JENKINS] Archiving disabled
[JENKINS] Archiving disabled
[JENKINS] Archiving disabled
[JENKINS] Archiving disabled
[JENKINS] Archiving disabled
[JENKINS] Archiving disabled
[JENKINS] Archiving disabled
[JENKINS] Archiving disabled
[JENKINS] Archiving disabled
[JENKINS] Archiving disabled
[JENKINS] Archiving disabled
[JENKINS] Archiving disabled
[JENKINS] Archiving disabled
[JENKINS] Archiving disabled
[JENKINS] Archiving disabled
[JENKINS] Archiving disabled
[JENKINS] Archiving disabled
[JENKINS] Archiving disabled
[JENKINS] Archiving disabled
[JENKINS] Archiving disabled
[JENKINS] Archiving disabled
[JENKINS] Archiving disabled
[JENKINS] Archiving disabled
[JENKINS] Archiving disabled
[JENKINS] Archiving disabled
[JENKINS] Archiving disabled
[JENKINS] Archiving disabled
[JENKINS] Archiving disabled
[JENKINS] Archiving disabled
[JENKINS] Archiving disabled
[JENKINS] Archiving disabled
[JENKINS] Archiving disabled
[JENKINS] Archiving disabled
Waiting for Jenkins to finish collecting data
channel stopped
[cloudstack-marvin-41] $ /bin/bash -xe /tmp/hudson6211159375016814165.sh
+ mvn -P developer -pl :cloud-apidoc -pl :cloud-marvin
[INFO] Scanning for projects...
[INFO] ------------------------------------------------------------------------
[INFO] Reactor Build Order:
[INFO] 
[INFO] Apache CloudStack apidoc Tools
[INFO] Apache CloudStack Developer Tools: marvin
[INFO]                                                                         
[INFO] ------------------------------------------------------------------------
[INFO] Building Apache CloudStack apidoc Tools 4.1.1-SNAPSHOT
[INFO] ------------------------------------------------------------------------
Downloading: http://repository.apache.org/snapshots/org/apache/cloudstack/cloud-client-ui/4.1.1-SNAPSHOT/maven-metadata.xml

Downloading: http://repository.apache.org/snapshots/org/apache/cloudstack/cloud-client-ui/4.1.1-SNAPSHOT/cloud-client-ui-4.1.1-SNAPSHOT.war

[INFO] ------------------------------------------------------------------------
[INFO] Reactor Summary:
[INFO] 
[INFO] Apache CloudStack apidoc Tools .................... FAILURE [2.148s]
[INFO] Apache CloudStack Developer Tools: marvin ......... SKIPPED
[INFO] ------------------------------------------------------------------------
[INFO] BUILD FAILURE
[INFO] ------------------------------------------------------------------------
[INFO] Total time: 3.327s
[INFO] Finished at: Sun Jun 23 19:16:32 UTC 2013
[INFO] Final Memory: 12M/83M
[INFO] ------------------------------------------------------------------------
[ERROR] Failed to execute goal on project cloud-apidoc: Could not resolve dependencies for
project org.apache.cloudstack:cloud-apidoc:pom:4.1.1-SNAPSHOT: Could not find artifact org.apache.cloudstack:cloud-client-ui:war:4.1.1-SNAPSHOT
in Nexus (http://repository.apache.org/snapshots) -> [Help 1]
[ERROR] 
[ERROR] To see the full stack trace of the errors, re-run Maven with the -e switch.
[ERROR] Re-run Maven using the -X switch to enable full debug logging.
[ERROR] 
[ERROR] For more information about the errors and possible solutions, please read the following
articles:
[ERROR] [Help 1] http://cwiki.apache.org/confluence/display/MAVEN/DependencyResolutionException
Build step 'Execute shell' marked build as failure
Archiving artifacts

Mime
View raw message