cloudstack-commits mailing list archives

Site index · List index
Message view « Date » · « Thread »
Top « Date » · « Thread »
From Apache Jenkins Server <jenk...@builds.apache.org>
Subject Build failed in Jenkins: cloudstack-marvin-41 #412
Date Tue, 18 Jun 2013 08:32:05 GMT
See <https://builds.apache.org/job/cloudstack-marvin-41/412/>

------------------------------------------
[...truncated 3075 lines...]
[INFO] [INFO] Using 'UTF-8' encoding to copy filtered resources.
[INFO] skip non existing resourceDirectory <https://builds.apache.org/job/cloudstack-marvin-41/ws/engine/storage/integration-test/src/main/resources>
[INFO] Copying 3 resources

[INFO] --- maven-resources-plugin:2.5:resources (default-resources) @ cloud-engine-storage-integration-test
---
[INFO] [INFO] No sources to compile

[INFO] --- maven-compiler-plugin:2.5.1:compile (default-compile) @ cloud-engine-storage-integration-test
---
[debug] execute contextualize
[INFO] [INFO] Using 'UTF-8' encoding to copy filtered resources.
[INFO] Copying 2 resources
[INFO] Copying 3 resources

[INFO] --- maven-resources-plugin:2.5:testResources (default-testResources) @ cloud-engine-storage-integration-test
---
[INFO] [INFO] Compiling 18 source files to <https://builds.apache.org/job/cloudstack-marvin-41/ws/engine/storage/integration-test/target/test-classes>

[INFO] --- maven-compiler-plugin:2.5.1:testCompile (default-testCompile) @ cloud-engine-storage-integration-test
---
[INFO] 
[INFO] [INFO] Nothing to compile - all classes are up to date
--- maven-compiler-plugin:2.5.1:testCompile (default) @ cloud-engine-storage-integration-test
---
[INFO] [INFO] Tests are skipped.

[INFO] --- maven-surefire-plugin:2.12:test (default-test) @ cloud-engine-storage-integration-test
---
[INFO] 
[INFO] --- maven-jar-plugin:2.4:jar (default-jar) @ cloud-engine-storage-integration-test
---
[INFO] Building jar: <https://builds.apache.org/job/cloudstack-marvin-41/ws/engine/storage/integration-test/target/cloud-engine-storage-integration-test-4.1.1-SNAPSHOT.jar>
[INFO] 
[INFO] --- maven-site-plugin:3.1:attach-descriptor (attach-descriptor) @ cloud-engine-storage-integration-test
---
[INFO] [INFO] Tests are skipped.

[INFO] --- maven-surefire-plugin:2.12:test (default) @ cloud-engine-storage-integration-test
---
[INFO] [INFO] Installing <https://builds.apache.org/job/cloudstack-marvin-41/ws/engine/storage/integration-test/target/cloud-engine-storage-integration-test-4.1.1-SNAPSHOT.jar>
to /home/jenkins/jenkins-slave/maven-repositories/1/org/apache/cloudstack/cloud-engine-storage-integration-test/4.1.1-SNAPSHOT/cloud-engine-storage-integration-test-4.1.1-SNAPSHOT.jar

[INFO] --- maven-install-plugin:2.3.1:install (default-install) @ cloud-engine-storage-integration-test
---
[INFO] Installing <https://builds.apache.org/job/cloudstack-marvin-41/ws/engine/storage/integration-test/pom.xml>
to /home/jenkins/jenkins-slave/maven-repositories/1/org/apache/cloudstack/cloud-engine-storage-integration-test/4.1.1-SNAPSHOT/cloud-engine-storage-integration-test-4.1.1-SNAPSHOT.pom
[INFO]                                                                         [INFO] Deleting
<https://builds.apache.org/job/cloudstack-marvin-41/ws/engine/service/target>

[INFO] ------------------------------------------------------------------------
[INFO] Building Apache CloudStack Cloud Engine Service 4.1.1-SNAPSHOT
[INFO] ------------------------------------------------------------------------
[INFO] 
[INFO] --- maven-clean-plugin:2.5:clean (default-clean) @ cloud-engine-service ---
[INFO] 
[INFO] --- maven-remote-resources-plugin:1.3:process (default) @ cloud-engine-service ---
[debug] execute contextualize
[INFO] [INFO] Using 'UTF-8' encoding to copy filtered resources.
[INFO] skip non existing resourceDirectory <https://builds.apache.org/job/cloudstack-marvin-41/ws/engine/service/src/main/resources>
[INFO] Copying 3 resources

[INFO] --- maven-resources-plugin:2.5:resources (default-resources) @ cloud-engine-service
---
[INFO] [INFO] Nothing to compile - all classes are up to date

[INFO] --- maven-compiler-plugin:2.5.1:compile (default-compile) @ cloud-engine-service ---
[debug] execute contextualize
[INFO] [INFO] Using 'UTF-8' encoding to copy filtered resources.
[INFO] skip non existing resourceDirectory <https://builds.apache.org/job/cloudstack-marvin-41/ws/engine/service/src/test/resources>
[INFO] Copying 3 resources

[INFO] --- maven-resources-plugin:2.5:testResources (default-testResources) @ cloud-engine-service
---
[INFO] [INFO] No sources to compile

[INFO] --- maven-compiler-plugin:2.5.1:testCompile (default-testCompile) @ cloud-engine-service
---
[INFO] [INFO] Surefire report directory: <https://builds.apache.org/job/cloudstack-marvin-41/ws/engine/service/target/surefire-reports>

[INFO] --- maven-surefire-plugin:2.12:test (default-test) @ cloud-engine-service ---

-------------------------------------------------------
 T E S T S
-------------------------------------------------------

Results :

Tests run: 0, Failures: 0, Errors: 0, Skipped: 0

[JENKINS] Recording test results
[INFO] 
[INFO] --- maven-war-plugin:2.1.1:war (default-war) @ cloud-engine-service ---
[INFO] Packaging webapp
[INFO] Assembling webapp [cloud-engine-service] in [<https://builds.apache.org/job/cloudstack-marvin-41/ws/engine/service/target/engine]>
[INFO] Processing war project
[INFO] Copying webapp resources [<https://builds.apache.org/job/cloudstack-marvin-41/ws/engine/service/src/main/webapp]>
[INFO] Webapp assembled in [132 msecs]
[INFO] Building war: <https://builds.apache.org/job/cloudstack-marvin-41/ws/engine/service/target/engine.war>
[INFO] WEB-INF/web.xml already added, skipping
[INFO] 
[INFO] --- maven-site-plugin:3.1:attach-descriptor (attach-descriptor) @ cloud-engine-service
---
[INFO] [INFO] Installing <https://builds.apache.org/job/cloudstack-marvin-41/ws/engine/service/target/engine.war>
to /home/jenkins/jenkins-slave/maven-repositories/1/org/apache/cloudstack/cloud-engine-service/4.1.1-SNAPSHOT/cloud-engine-service-4.1.1-SNAPSHOT.war

[INFO] --- maven-install-plugin:2.3.1:install (default-install) @ cloud-engine-service ---
[INFO] Installing <https://builds.apache.org/job/cloudstack-marvin-41/ws/engine/service/pom.xml>
to /home/jenkins/jenkins-slave/maven-repositories/1/org/apache/cloudstack/cloud-engine-service/4.1.1-SNAPSHOT/cloud-engine-service-4.1.1-SNAPSHOT.pom
[INFO] ------------------------------------------------------------------------
[INFO] Reactor Summary:
[INFO] 
[INFO] Apache CloudStack ................................. SUCCESS [4.965s]
[INFO] Apache CloudStack Utils ........................... SUCCESS [14.609s]
[INFO] Apache CloudStack API ............................. SUCCESS [6.753s]
[INFO] Apache CloudStack Core ............................ SUCCESS [7.052s]
[INFO] Apache CloudStack Agents .......................... SUCCESS [4.416s]
[INFO] Apache CloudStack SystemVM Patches ................ SUCCESS [0.639s]
[INFO] Apache CloudStack Console Proxy ................... SUCCESS [6.046s]
[INFO] Apache CloudStack Framework ....................... SUCCESS [0.221s]
[INFO] Apache CloudStack Framework - IPC ................. SUCCESS [2.761s]
[INFO] Apache CloudStack Framework - REST ................ SUCCESS [3.143s]
[INFO] Apache CloudStack Cloud Engine .................... SUCCESS [0.219s]
[INFO] Apache CloudStack Cloud Engine API ................ SUCCESS [2.063s]
[INFO] Apache CloudStack Framework - Event Notification .. SUCCESS [1.668s]
[INFO] Apache CloudStack Server .......................... SUCCESS [14.357s]
[INFO] Apache CloudStack Usage Server .................... SUCCESS [4.164s]
[INFO] Apache XenSource XAPI ............................. SUCCESS [2.512s]
[INFO] Apache CloudStack Plugin POM ...................... SUCCESS [2.213s]
[INFO] Apache CloudStack Plugin - API Rate Limit ......... SUCCESS [4.427s]
[INFO] Apache CloudStack Plugin - API Discovery .......... SUCCESS [3.145s]
[INFO] Apache CloudStack Plugin - ACL Static Role Based .. SUCCESS [1.850s]
[INFO] Apache CloudStack Plugin - User Concentrated Pod Deployment Planner  SUCCESS [1.711s]
[INFO] Apache CloudStack Plugin - User Dispersing Deployment Planner  SUCCESS [2.182s]
[INFO] Apache CloudStack Plugin - Host Allocator Random .. SUCCESS [1.819s]
[INFO] Apache CloudStack Plugin - Hypervisor OracleVM .... SUCCESS [2.237s]
[INFO] Apache CloudStack Cloud Engine Internal Components API  SUCCESS [1.969s]
[INFO] Apache CloudStack Engine Storage Component ........ SUCCESS [2.322s]
[INFO] Apache CloudStack Plugin - Open vSwitch ........... SUCCESS [1.747s]
[INFO] Apache CloudStack Plugin - Hypervisor Xen ......... SUCCESS [3.560s]
[INFO] Apache CloudStack Plugin - Hypervisor KVM ......... SUCCESS [3.742s]
[INFO] Apache CloudStack Plugin - RabbitMQ Event Bus ..... SUCCESS [1.878s]
[INFO] Apache CloudStack Plugin - Hypervisor Simulator ... SUCCESS [3.090s]
[INFO] Apache CloudStack Plugin - Network Elastic Load Balancer  SUCCESS [1.900s]
[INFO] Apache CloudStack Plugin - Network Nicira NVP ..... SUCCESS [5.013s]
[INFO] Apache CloudStack Plugin - BigSwitch Virtual Network Segment  SUCCESS [3.487s]
[INFO] Apache CloudStack Plugin - Storage Allocator Random  SUCCESS [1.779s]
[INFO] Apache CloudStack Plugin - User Authenticator LDAP  SUCCESS [3.148s]
[INFO] Apache CloudStack Plugin - User Authenticator MD5 . SUCCESS [1.847s]
[INFO] Apache CloudStack Plugin - User Authenticator Plain Text  SUCCESS [1.911s]
[INFO] Apache CloudStack Plugin - User Authenticator SHA256 Salted  SUCCESS [3.652s]
[INFO] Apache CloudStack Plugin - Dns Notifier Example ... SUCCESS [1.847s]
[INFO] Apache CloudStack Engine Storage Image Component .. SUCCESS [10.204s]
[INFO] Apache CloudStack Plugin - Storage Image S3 ....... SUCCESS [2.103s]
[INFO] Apache CloudStack Engine Storage Volume Component . SUCCESS [4.800s]
[INFO] Apache CloudStack Plugin - Storage Volume solidfire  SUCCESS [4.969s]
[INFO] Apache CloudStack Cloud Engine Compute Component .. SUCCESS [1.437s]
[INFO] Apache CloudStack Cloud Engine API ................ SUCCESS [2.189s]
[INFO] Apache CloudStack Cloud Engine Orchestration Component  SUCCESS [2.987s]
[INFO] Apache CloudStack Cloud Engine Schema Component ... SUCCESS [1.235s]
[INFO] Apache CloudStack Engine Storage Backup Component . SUCCESS [1.878s]
[INFO] Apache CloudStack Engine Storage Image Motion Component  SUCCESS [1.584s]
[INFO] Apache CloudStack Engine Storage Snapshot Component  SUCCESS [1.861s]
[INFO] Apache CloudStack Client UI ....................... SUCCESS [10.076s]
[INFO] Apache CloudStack Test ............................ SUCCESS [2.837s]
[INFO] Apache CloudStack Engine Storage integration test Component  SUCCESS [2.214s]
[INFO] Apache CloudStack Cloud Engine Service ............ SUCCESS [6.097s]
[INFO] ------------------------------------------------------------------------
[INFO] BUILD SUCCESS
[INFO] ------------------------------------------------------------------------
[INFO] Total time: 3:17.365s
[INFO] Finished at: Tue Jun 18 08:31:14 UTC 2013
[INFO] Final Memory: 36M/182M
[INFO] ------------------------------------------------------------------------
[JENKINS] Archiving disabled
[JENKINS] Archiving disabled
[JENKINS] Archiving disabled
[JENKINS] Archiving disabled
[JENKINS] Archiving disabled
[JENKINS] Archiving disabled
[JENKINS] Archiving disabled
[JENKINS] Archiving disabled
[JENKINS] Archiving disabled
[JENKINS] Archiving disabled
[JENKINS] Archiving disabled
[JENKINS] Archiving disabled
[JENKINS] Archiving disabled
[JENKINS] Archiving disabled
[JENKINS] Archiving disabled
[JENKINS] Archiving disabled
[JENKINS] Archiving disabled
[JENKINS] Archiving disabled
[JENKINS] Archiving disabled
[JENKINS] Archiving disabled
[JENKINS] Archiving disabled
[JENKINS] Archiving disabled
[JENKINS] Archiving disabled
[JENKINS] Archiving disabled
[JENKINS] Archiving disabled
[JENKINS] Archiving disabled
[JENKINS] Archiving disabled
[JENKINS] Archiving disabled
[JENKINS] Archiving disabled
[JENKINS] Archiving disabled
[JENKINS] Archiving disabled
[JENKINS] Archiving disabled
[JENKINS] Archiving disabled
[JENKINS] Archiving disabled
[JENKINS] Archiving disabled
[JENKINS] Archiving disabled
[JENKINS] Archiving disabled
[JENKINS] Archiving disabled
[JENKINS] Archiving disabled
[JENKINS] Archiving disabled
[JENKINS] Archiving disabled
[JENKINS] Archiving disabled
[JENKINS] Archiving disabled
[JENKINS] Archiving disabled
[JENKINS] Archiving disabled
[JENKINS] Archiving disabled
[JENKINS] Archiving disabled
[JENKINS] Archiving disabled
[JENKINS] Archiving disabled
[JENKINS] Archiving disabled
[JENKINS] Archiving disabled
[JENKINS] Archiving disabled
[JENKINS] Archiving disabled
[JENKINS] Archiving disabled
[JENKINS] Archiving disabled
Waiting for Jenkins to finish collecting data
channel stopped
[cloudstack-marvin-41] $ /bin/bash -xe /tmp/hudson6160059089971267641.sh
+ mvn -P developer -pl :cloud-apidoc -pl :cloud-marvin
[INFO] Scanning for projects...
[INFO] ------------------------------------------------------------------------
[INFO] Reactor Build Order:
[INFO] 
[INFO] Apache CloudStack apidoc Tools
[INFO] Apache CloudStack Developer Tools: marvin
[INFO]                                                                         
[INFO] ------------------------------------------------------------------------
[INFO] Building Apache CloudStack apidoc Tools 4.1.1-SNAPSHOT
[INFO] ------------------------------------------------------------------------
Downloading: http://repository.apache.org/snapshots/org/apache/cloudstack/cloud-client-ui/4.1.1-SNAPSHOT/maven-metadata.xml

Downloading: http://repository.apache.org/snapshots/org/apache/cloudstack/cloud-client-ui/4.1.1-SNAPSHOT/cloud-client-ui-4.1.1-SNAPSHOT.war

[INFO] ------------------------------------------------------------------------
[INFO] Reactor Summary:
[INFO] 
[INFO] Apache CloudStack apidoc Tools .................... FAILURE [1.119s]
[INFO] Apache CloudStack Developer Tools: marvin ......... SKIPPED
[INFO] ------------------------------------------------------------------------
[INFO] BUILD FAILURE
[INFO] ------------------------------------------------------------------------
[INFO] Total time: 2.055s
[INFO] Finished at: Tue Jun 18 08:31:53 UTC 2013
[INFO] Final Memory: 12M/79M
[INFO] ------------------------------------------------------------------------
[ERROR] Failed to execute goal on project cloud-apidoc: Could not resolve dependencies for
project org.apache.cloudstack:cloud-apidoc:pom:4.1.1-SNAPSHOT: Could not find artifact org.apache.cloudstack:cloud-client-ui:war:4.1.1-SNAPSHOT
in Nexus (http://repository.apache.org/snapshots) -> [Help 1]
[ERROR] 
[ERROR] To see the full stack trace of the errors, re-run Maven with the -e switch.
[ERROR] Re-run Maven using the -X switch to enable full debug logging.
[ERROR] 
[ERROR] For more information about the errors and possible solutions, please read the following
articles:
[ERROR] [Help 1] http://cwiki.apache.org/confluence/display/MAVEN/DependencyResolutionException
Build step 'Execute shell' marked build as failure
Archiving artifacts

Mime
View raw message