cloudstack-commits mailing list archives

Site index · List index
Message view « Date » · « Thread »
Top « Date » · « Thread »
From Apache Jenkins Server <jenk...@builds.apache.org>
Subject Build failed in Jenkins: cloudstack-apidocs-41 #387
Date Tue, 18 Jun 2013 17:02:06 GMT
See <https://builds.apache.org/job/cloudstack-apidocs-41/387/>

------------------------------------------
[...truncated 2047 lines...]
[INFO] [INFO] Installing <https://builds.apache.org/job/cloudstack-apidocs-41/ws/plugins/network-elements/nicira-nvp/target/cloud-plugin-network-nvp-4.1.1-SNAPSHOT.jar>
to /home/jenkins/jenkins-slave/maven-repositories/0/org/apache/cloudstack/cloud-plugin-network-nvp/4.1.1-SNAPSHOT/cloud-plugin-network-nvp-4.1.1-SNAPSHOT.jar
[INFO] Installing <https://builds.apache.org/job/cloudstack-apidocs-41/ws/plugins/network-elements/nicira-nvp/pom.xml>
to /home/jenkins/jenkins-slave/maven-repositories/0/org/apache/cloudstack/cloud-plugin-network-nvp/4.1.1-SNAPSHOT/cloud-plugin-network-nvp-4.1.1-SNAPSHOT.pom

[INFO] --- maven-install-plugin:2.3.1:install (default-install) @ cloud-plugin-network-nvp
---
[INFO] [INFO] Deleting <https://builds.apache.org/job/cloudstack-apidocs-41/ws/plugins/network-elements/bigswitch-vns/target>
                                                                        
[INFO] ------------------------------------------------------------------------
[INFO] Building Apache CloudStack Plugin - BigSwitch Virtual Network Segment 4.1.1-SNAPSHOT
[INFO] ------------------------------------------------------------------------
[INFO] 
[INFO] --- maven-clean-plugin:2.5:clean (default-clean) @ cloud-plugin-network-vns ---
[INFO] 
[INFO] --- maven-remote-resources-plugin:1.3:process (default) @ cloud-plugin-network-vns
---
[debug] execute contextualize
[INFO] [INFO] Using 'UTF-8' encoding to copy filtered resources.
[INFO] skip non existing resourceDirectory <https://builds.apache.org/job/cloudstack-apidocs-41/ws/plugins/network-elements/bigswitch-vns/src/main/resources>
[INFO] Copying 3 resources

[INFO] --- maven-resources-plugin:2.5:resources (default-resources) @ cloud-plugin-network-vns
---
[INFO] [INFO] Compiling 29 source files to <https://builds.apache.org/job/cloudstack-apidocs-41/ws/plugins/network-elements/bigswitch-vns/target/classes>

[INFO] --- maven-compiler-plugin:2.5.1:compile (default-compile) @ cloud-plugin-network-vns
---
[INFO] [debug] execute contextualize
[INFO] Using 'UTF-8' encoding to copy filtered resources.
[INFO] skip non existing resourceDirectory <https://builds.apache.org/job/cloudstack-apidocs-41/ws/plugins/network-elements/bigswitch-vns/src/test/resources>
[INFO] Copying 3 resources

[INFO] --- maven-resources-plugin:2.5:testResources (default-testResources) @ cloud-plugin-network-vns
---
[INFO] [INFO] Compiling 2 source files to <https://builds.apache.org/job/cloudstack-apidocs-41/ws/plugins/network-elements/bigswitch-vns/target/test-classes>

[INFO] --- maven-compiler-plugin:2.5.1:testCompile (default-testCompile) @ cloud-plugin-network-vns
---
[INFO] [INFO] Surefire report directory: <https://builds.apache.org/job/cloudstack-apidocs-41/ws/plugins/network-elements/bigswitch-vns/target/surefire-reports>

-------------------------------------------------------
 T E S T S
-------------------------------------------------------

[INFO] --- maven-surefire-plugin:2.12:test (default-test) @ cloud-plugin-network-vns ---
Running com.cloud.network.resource.BigSwitchVnsResourceTest
log4j:WARN No appenders could be found for logger (org.apache.commons.httpclient.params.DefaultHttpParams).
log4j:WARN Please initialize the log4j system properly.
log4j:WARN See http://logging.apache.org/log4j/1.2/faq.html#noconfig for more info.
Tests run: 16, Failures: 0, Errors: 0, Skipped: 0, Time elapsed: 0.358 sec
Running com.cloud.network.bigswitch.BigSwitchApiTest
Tests run: 14, Failures: 0, Errors: 0, Skipped: 0, Time elapsed: 0.341 sec

Results :

Tests run: 30, Failures: 0, Errors: 0, Skipped: 0

[JENKINS] Recording test results
[INFO] [INFO] Building jar: <https://builds.apache.org/job/cloudstack-apidocs-41/ws/plugins/network-elements/bigswitch-vns/target/cloud-plugin-network-vns-4.1.1-SNAPSHOT.jar>

[INFO] --- maven-jar-plugin:2.4:jar (default-jar) @ cloud-plugin-network-vns ---
[INFO] 
[INFO] --- maven-site-plugin:3.1:attach-descriptor (attach-descriptor) @ cloud-plugin-network-vns
---
[INFO] Installing <https://builds.apache.org/job/cloudstack-apidocs-41/ws/plugins/network-elements/bigswitch-vns/target/cloud-plugin-network-vns-4.1.1-SNAPSHOT.jar>
to /home/jenkins/jenkins-slave/maven-repositories/0/org/apache/cloudstack/cloud-plugin-network-vns/4.1.1-SNAPSHOT/cloud-plugin-network-vns-4.1.1-SNAPSHOT.jar
[INFO] [INFO] Installing <https://builds.apache.org/job/cloudstack-apidocs-41/ws/plugins/network-elements/bigswitch-vns/pom.xml>
to /home/jenkins/jenkins-slave/maven-repositories/0/org/apache/cloudstack/cloud-plugin-network-vns/4.1.1-SNAPSHOT/cloud-plugin-network-vns-4.1.1-SNAPSHOT.pom

[INFO] --- maven-install-plugin:2.3.1:install (default-install) @ cloud-plugin-network-vns
---
[INFO] [INFO] Deleting <https://builds.apache.org/job/cloudstack-apidocs-41/ws/plugins/storage-allocators/random/target>
                                                                        
[INFO] ------------------------------------------------------------------------
[INFO] Building Apache CloudStack Plugin - Storage Allocator Random 4.1.1-SNAPSHOT
[INFO] ------------------------------------------------------------------------
[INFO] 
[INFO] --- maven-clean-plugin:2.5:clean (default-clean) @ cloud-plugin-storage-allocator-random
---
[INFO] 
[INFO] --- maven-remote-resources-plugin:1.3:process (default) @ cloud-plugin-storage-allocator-random
---
[debug] execute contextualize
[INFO] [INFO] Using 'UTF-8' encoding to copy filtered resources.
[INFO] skip non existing resourceDirectory <https://builds.apache.org/job/cloudstack-apidocs-41/ws/plugins/storage-allocators/random/src/main/resources>
[INFO] Copying 3 resources

[INFO] --- maven-resources-plugin:2.5:resources (default-resources) @ cloud-plugin-storage-allocator-random
---
[INFO] [INFO] Compiling 1 source file to <https://builds.apache.org/job/cloudstack-apidocs-41/ws/plugins/storage-allocators/random/target/classes>

[INFO] --- maven-compiler-plugin:2.5.1:compile (default-compile) @ cloud-plugin-storage-allocator-random
---
[INFO] [debug] execute contextualize
[INFO] Using 'UTF-8' encoding to copy filtered resources.
[INFO] skip non existing resourceDirectory <https://builds.apache.org/job/cloudstack-apidocs-41/ws/plugins/storage-allocators/random/src/test/resources>
[INFO] Copying 3 resources

[INFO] --- maven-resources-plugin:2.5:testResources (default-testResources) @ cloud-plugin-storage-allocator-random
---
[INFO] [INFO] No sources to compile

[INFO] --- maven-compiler-plugin:2.5.1:testCompile (default-testCompile) @ cloud-plugin-storage-allocator-random
---
[INFO] [INFO] Surefire report directory: <https://builds.apache.org/job/cloudstack-apidocs-41/ws/plugins/storage-allocators/random/target/surefire-reports>

-------------------------------------------------------
 T E S T S
-------------------------------------------------------

[INFO] --- maven-surefire-plugin:2.12:test (default-test) @ cloud-plugin-storage-allocator-random
---

Results :

Tests run: 0, Failures: 0, Errors: 0, Skipped: 0

[JENKINS] Recording test results
[INFO] Building jar: <https://builds.apache.org/job/cloudstack-apidocs-41/ws/plugins/storage-allocators/random/target/cloud-plugin-storage-allocator-random-4.1.1-SNAPSHOT.jar>
[INFO] 
[INFO] --- maven-jar-plugin:2.4:jar (default-jar) @ cloud-plugin-storage-allocator-random
---
[INFO] 
[INFO] --- maven-site-plugin:3.1:attach-descriptor (attach-descriptor) @ cloud-plugin-storage-allocator-random
---
[INFO] [INFO] Installing <https://builds.apache.org/job/cloudstack-apidocs-41/ws/plugins/storage-allocators/random/target/cloud-plugin-storage-allocator-random-4.1.1-SNAPSHOT.jar>
to /home/jenkins/jenkins-slave/maven-repositories/0/org/apache/cloudstack/cloud-plugin-storage-allocator-random/4.1.1-SNAPSHOT/cloud-plugin-storage-allocator-random-4.1.1-SNAPSHOT.jar
[INFO] Installing <https://builds.apache.org/job/cloudstack-apidocs-41/ws/plugins/storage-allocators/random/pom.xml>
to /home/jenkins/jenkins-slave/maven-repositories/0/org/apache/cloudstack/cloud-plugin-storage-allocator-random/4.1.1-SNAPSHOT/cloud-plugin-storage-allocator-random-4.1.1-SNAPSHOT.pom

[INFO] --- maven-install-plugin:2.3.1:install (default-install) @ cloud-plugin-storage-allocator-random
---
[INFO] [INFO] Deleting <https://builds.apache.org/job/cloudstack-apidocs-41/ws/plugins/user-authenticators/ldap/target>
                                                                        
[INFO] ------------------------------------------------------------------------
[INFO] Building Apache CloudStack Plugin - User Authenticator LDAP 4.1.1-SNAPSHOT
[INFO] ------------------------------------------------------------------------
[INFO] 
[INFO] --- maven-clean-plugin:2.5:clean (default-clean) @ cloud-plugin-user-authenticator-ldap
---
[INFO] 
[INFO] --- maven-remote-resources-plugin:1.3:process (default) @ cloud-plugin-user-authenticator-ldap
---
[INFO] [debug] execute contextualize
[INFO] Using 'UTF-8' encoding to copy filtered resources.
[INFO] skip non existing resourceDirectory <https://builds.apache.org/job/cloudstack-apidocs-41/ws/plugins/user-authenticators/ldap/src/main/resources>
[INFO] Copying 3 resources

[INFO] --- maven-resources-plugin:2.5:resources (default-resources) @ cloud-plugin-user-authenticator-ldap
---
[INFO] [INFO] Compiling 1 source file to <https://builds.apache.org/job/cloudstack-apidocs-41/ws/plugins/user-authenticators/ldap/target/classes>

[INFO] --- maven-compiler-plugin:2.5.1:compile (default-compile) @ cloud-plugin-user-authenticator-ldap
---
[debug] execute contextualize
[INFO] [INFO] Using 'UTF-8' encoding to copy filtered resources.
[INFO] skip non existing resourceDirectory <https://builds.apache.org/job/cloudstack-apidocs-41/ws/plugins/user-authenticators/ldap/src/test/resources>
[INFO] Copying 3 resources

[INFO] --- maven-resources-plugin:2.5:testResources (default-testResources) @ cloud-plugin-user-authenticator-ldap
---
[INFO] No sources to compile
[INFO] 
[INFO] --- maven-compiler-plugin:2.5.1:testCompile (default-testCompile) @ cloud-plugin-user-authenticator-ldap
---
[INFO] [INFO] Surefire report directory: <https://builds.apache.org/job/cloudstack-apidocs-41/ws/plugins/user-authenticators/ldap/target/surefire-reports>

-------------------------------------------------------
 T E S T S
-------------------------------------------------------

[INFO] --- maven-surefire-plugin:2.12:test (default-test) @ cloud-plugin-user-authenticator-ldap
---

Results :

Tests run: 0, Failures: 0, Errors: 0, Skipped: 0

[JENKINS] Recording test results
[INFO] [INFO] Building jar: <https://builds.apache.org/job/cloudstack-apidocs-41/ws/plugins/user-authenticators/ldap/target/cloud-plugin-user-authenticator-ldap-4.1.1-SNAPSHOT.jar>

[INFO] --- maven-jar-plugin:2.4:jar (default-jar) @ cloud-plugin-user-authenticator-ldap ---
[INFO] 
[INFO] --- maven-site-plugin:3.1:attach-descriptor (attach-descriptor) @ cloud-plugin-user-authenticator-ldap
---
[INFO] Installing <https://builds.apache.org/job/cloudstack-apidocs-41/ws/plugins/user-authenticators/ldap/target/cloud-plugin-user-authenticator-ldap-4.1.1-SNAPSHOT.jar>
to /home/jenkins/jenkins-slave/maven-repositories/0/org/apache/cloudstack/cloud-plugin-user-authenticator-ldap/4.1.1-SNAPSHOT/cloud-plugin-user-authenticator-ldap-4.1.1-SNAPSHOT.jar
[INFO] Installing <https://builds.apache.org/job/cloudstack-apidocs-41/ws/plugins/user-authenticators/ldap/pom.xml>
to /home/jenkins/jenkins-slave/maven-repositories/0/org/apache/cloudstack/cloud-plugin-user-authenticator-ldap/4.1.1-SNAPSHOT/cloud-plugin-user-authenticator-ldap-4.1.1-SNAPSHOT.pom
[INFO] 
[INFO] --- maven-install-plugin:2.3.1:install (default-install) @ cloud-plugin-user-authenticator-ldap
---
[INFO] [INFO] Deleting <https://builds.apache.org/job/cloudstack-apidocs-41/ws/plugins/user-authenticators/md5/target>
                                                                        
[INFO] ------------------------------------------------------------------------
[INFO] Building Apache CloudStack Plugin - User Authenticator MD5 4.1.1-SNAPSHOT
[INFO] ------------------------------------------------------------------------
[INFO] 
[INFO] --- maven-clean-plugin:2.5:clean (default-clean) @ cloud-plugin-user-authenticator-md5
---
[INFO] 
[INFO] --- maven-remote-resources-plugin:1.3:process (default) @ cloud-plugin-user-authenticator-md5
---
[debug] execute contextualize
[INFO] Using 'UTF-8' encoding to copy filtered resources.
[INFO] skip non existing resourceDirectory <https://builds.apache.org/job/cloudstack-apidocs-41/ws/plugins/user-authenticators/md5/src/main/resources>
[INFO] [INFO] Copying 3 resources

[INFO] --- maven-resources-plugin:2.5:resources (default-resources) @ cloud-plugin-user-authenticator-md5
---
[INFO] [INFO] Compiling 1 source file to <https://builds.apache.org/job/cloudstack-apidocs-41/ws/plugins/user-authenticators/md5/target/classes>

[INFO] --- maven-compiler-plugin:2.5.1:compile (default-compile) @ cloud-plugin-user-authenticator-md5
---
[debug] execute contextualize
[INFO] [INFO] Using 'UTF-8' encoding to copy filtered resources.
[INFO] skip non existing resourceDirectory <https://builds.apache.org/job/cloudstack-apidocs-41/ws/plugins/user-authenticators/md5/src/test/resources>
[INFO] Copying 3 resources

[INFO] --- maven-resources-plugin:2.5:testResources (default-testResources) @ cloud-plugin-user-authenticator-md5
---
[INFO] [INFO] No sources to compile

[INFO] --- maven-compiler-plugin:2.5.1:testCompile (default-testCompile) @ cloud-plugin-user-authenticator-md5
---
[INFO] [INFO] Surefire report directory: <https://builds.apache.org/job/cloudstack-apidocs-41/ws/plugins/user-authenticators/md5/target/surefire-reports>

-------------------------------------------------------
 T E S T S
-------------------------------------------------------

[INFO] --- maven-surefire-plugin:2.12:test (default-test) @ cloud-plugin-user-authenticator-md5
---

Results :

Tests run: 0, Failures: 0, Errors: 0, Skipped: 0

[JENKINS] Recording test results
[INFO] Building jar: <https://builds.apache.org/job/cloudstack-apidocs-41/ws/plugins/user-authenticators/md5/target/cloud-plugin-user-authenticator-md5-4.1.1-SNAPSHOT.jar>
[INFO] 
[INFO] --- maven-jar-plugin:2.4:jar (default-jar) @ cloud-plugin-user-authenticator-md5 ---
[INFO] 
[INFO] --- maven-site-plugin:3.1:attach-descriptor (attach-descriptor) @ cloud-plugin-user-authenticator-md5
---
[INFO] [INFO] Installing <https://builds.apache.org/job/cloudstack-apidocs-41/ws/plugins/user-authenticators/md5/target/cloud-plugin-user-authenticator-md5-4.1.1-SNAPSHOT.jar>
to /home/jenkins/jenkins-slave/maven-repositories/0/org/apache/cloudstack/cloud-plugin-user-authenticator-md5/4.1.1-SNAPSHOT/cloud-plugin-user-authenticator-md5-4.1.1-SNAPSHOT.jar
[INFO] Installing <https://builds.apache.org/job/cloudstack-apidocs-41/ws/plugins/user-authenticators/md5/pom.xml>
to /home/jenkins/jenkins-slave/maven-repositories/0/org/apache/cloudstack/cloud-plugin-user-authenticator-md5/4.1.1-SNAPSHOT/cloud-plugin-user-authenticator-md5-4.1.1-SNAPSHOT.pom

[INFO] --- maven-install-plugin:2.3.1:install (default-install) @ cloud-plugin-user-authenticator-md5
---
[INFO] [INFO] Deleting <https://builds.apache.org/job/cloudstack-apidocs-41/ws/plugins/user-authenticators/plain-text/target>
                                                                        
[INFO] ------------------------------------------------------------------------
[INFO] Building Apache CloudStack Plugin - User Authenticator Plain Text 4.1.1-SNAPSHOT
[INFO] ------------------------------------------------------------------------
[INFO] 
[INFO] --- maven-clean-plugin:2.5:clean (default-clean) @ cloud-plugin-user-authenticator-plaintext
---
[INFO] 
[INFO] --- maven-remote-resources-plugin:1.3:process (default) @ cloud-plugin-user-authenticator-plaintext
---
[debug] execute contextualize
[INFO] Using 'UTF-8' encoding to copy filtered resources.
[INFO] skip non existing resourceDirectory <https://builds.apache.org/job/cloudstack-apidocs-41/ws/plugins/user-authenticators/plain-text/src/main/resources>
[INFO] [INFO] Copying 3 resources

[INFO] --- maven-resources-plugin:2.5:resources (default-resources) @ cloud-plugin-user-authenticator-plaintext
---
[INFO] [INFO] Compiling 1 source file to <https://builds.apache.org/job/cloudstack-apidocs-41/ws/plugins/user-authenticators/plain-text/target/classes>

[INFO] --- maven-compiler-plugin:2.5.1:compile (default-compile) @ cloud-plugin-user-authenticator-plaintext
---
[cloudstack-apidocs-41] $ /bin/bash -xe /tmp/hudson4350315344446397065.sh
+ mvn -P developer -pl :cloud-apidoc
[INFO] Scanning for projects...
[INFO]                                                                         
[INFO] ------------------------------------------------------------------------
[INFO] Building Apache CloudStack apidoc Tools 4.1.1-SNAPSHOT
[INFO] ------------------------------------------------------------------------
[INFO] ------------------------------------------------------------------------
[INFO] BUILD FAILURE
[INFO] ------------------------------------------------------------------------
[INFO] Total time: 1.411s
[INFO] Finished at: Tue Jun 18 17:02:06 UTC 2013
[INFO] Final Memory: 12M/114M
[INFO] ------------------------------------------------------------------------
[ERROR] Failed to execute goal on project cloud-apidoc: Could not resolve dependencies for
project org.apache.cloudstack:cloud-apidoc:pom:4.1.1-SNAPSHOT: Failure to find org.apache.cloudstack:cloud-client-ui:war:4.1.1-SNAPSHOT
in http://repository.apache.org/snapshots was cached in the local repository, resolution will
not be reattempted until the update interval of Nexus has elapsed or updates are forced ->
[Help 1]
[ERROR] 
[ERROR] To see the full stack trace of the errors, re-run Maven with the -e switch.
[ERROR] Re-run Maven using the -X switch to enable full debug logging.
[ERROR] 
[ERROR] For more information about the errors and possible solutions, please read the following
articles:
[ERROR] [Help 1] http://cwiki.apache.org/confluence/display/MAVEN/DependencyResolutionException
Build step 'Execute shell' marked build as failure
ERROR: Maven JVM terminated unexpectedly with exit code 143
Archiving artifacts

Mime
View raw message