cloudstack-commits mailing list archives

Site index · List index
Message view « Date » · « Thread »
Top « Date » · « Thread »
From Apache Jenkins Server <jenk...@builds.apache.org>
Subject Build failed in Jenkins: cloudstack-marvin #704
Date Thu, 02 May 2013 13:05:11 GMT
See <https://builds.apache.org/job/cloudstack-marvin/704/changes>

Changes:

[brian.federle] Add granular settings widget

[brian.federle] Add zone-level granular settings UI

[brian.federle] Add cluster-level parameters

[brian.federle] Add primary storage-level parameters UI

[brian.federle] Add seondary storage-level parameters UI

[brian.federle] Add account-level parameter UI

[brian.federle] Always maximize detail views with settings tab (to fit listView layout)

[murali.reddy] CLOUDSTACK-1828 Source Nat on private gateway feature

[sateesh] CLOUDSTACK-2087: Destroying the instance is not decrementing the primary storage
usage [Resource Count table - No of volumes is not got decremented]

[sateesh] Fixing build breakage.

[sateesh] Fixing build breakage.

[pranav.saxena] CLOUDSTACK-2041:Granular global parameter- Zone settings

[pranav.saxena] CLOUDSTACK-2041:Granular global parameter- Cluster settings

------------------------------------------
[...truncated 3792 lines...]
[INFO] cloud-framework-api ............................... SUCCESS [2.726s]
[INFO] Apache CloudStack Framework - REST ................ SUCCESS [3.248s]
[INFO] Apache CloudStack Cloud Engine .................... SUCCESS [0.513s]
[INFO] Apache CloudStack Cloud Engine API ................ SUCCESS [4.451s]
[INFO] Apache CloudStack Core ............................ SUCCESS [5.191s]
[INFO] Apache CloudStack Agents .......................... SUCCESS [7.475s]
[INFO] Apache CloudStack Framework - Event Notification .. SUCCESS [2.807s]
[INFO] Apache CloudStack Server .......................... SUCCESS [32.408s]
[INFO] Apache CloudStack Usage Server .................... SUCCESS [6.500s]
[INFO] Apache XenSource XAPI ............................. SUCCESS [5.707s]
[INFO] Apache CloudStack Framework - IPC ................. SUCCESS [5.700s]
[INFO] Apache CloudStack Cloud Engine Internal Components API  SUCCESS [2.947s]
[INFO] Apache CloudStack Cloud Engine Compute Component .. SUCCESS [2.701s]
[INFO] Apache CloudStack Cloud Engine Orchestration Component  SUCCESS [4.471s]
[INFO] Apache CloudStack Engine Storage Component ........ SUCCESS [3.886s]
[INFO] Apache CloudStack Engine Storage Volume Component . SUCCESS [4.302s]
[INFO] Apache CloudStack Engine Storage Image Component .. SUCCESS [3.822s]
[INFO] Apache CloudStack Engine Storage Image Motion Component  SUCCESS [3.401s]
[INFO] Apache CloudStack Engine Storage Backup Component . SUCCESS [3.068s]
[INFO] Apache CloudStack Engine Storage Snapshot Component  SUCCESS [4.488s]
[INFO] Apache CloudStack Plugin POM ...................... SUCCESS [1.063s]
[INFO] Apache CloudStack Plugin - Open vSwitch ........... SUCCESS [3.591s]
[INFO] Apache CloudStack Plugin - Hypervisor Xen ......... SUCCESS [6.528s]
[INFO] Apache CloudStack Engine Storage integration test Component  SUCCESS [4.802s]
[INFO] Apache CloudStack Cloud Engine Schema Component ... SUCCESS [2.274s]
[INFO] Apache CloudStack Cloud Engine API ................ SUCCESS [4.150s]
[INFO] Apache CloudStack Cloud Engine Service ............ SUCCESS [10.198s]
[INFO] Apache CloudStack Plugin - API Rate Limit ......... SUCCESS [7.240s]
[INFO] Apache CloudStack Plugin - API Discovery .......... SUCCESS [4.182s]
[INFO] Apache CloudStack Plugin - ACL Static Role Based .. SUCCESS [4.507s]
[INFO] Apache CloudStack Plugin - Host Anti-Affinity Processor  SUCCESS [2.835s]
[INFO] Apache CloudStack Plugin - User Concentrated Pod Deployment Planner  SUCCESS [2.839s]
[INFO] Apache CloudStack Plugin - User Dispersing Deployment Planner  SUCCESS [2.796s]
[INFO] Apache CloudStack Plugin - Host Allocator Random .. SUCCESS [2.837s]
[INFO] Apache CloudStack Plugin - Hypervisor OracleVM .... SUCCESS [3.243s]
[INFO] Apache CloudStack Plugin - Hypervisor KVM ......... SUCCESS [12.220s]
[INFO] Apache CloudStack Plugin - RabbitMQ Event Bus ..... SUCCESS [4.688s]
[INFO] Apache CloudStack SystemVM Patches ................ SUCCESS [0.985s]
[INFO] Apache CloudStack Cloud Services .................. SUCCESS [0.569s]
[INFO] Apache CloudStack Secondary Storage Service ....... SUCCESS [3.452s]
[INFO] Apache CloudStack Plugin - Hypervisor Simulator ... SUCCESS [3.462s]
[INFO] Apache CloudStack Plugin - Hypervisor Baremetal ... SUCCESS [3.435s]
[INFO] Apache CloudStack Plugin - Hypervisor UCS ......... SUCCESS [2.978s]
[INFO] Apache CloudStack Plugin - Network Elastic Load Balancer  SUCCESS [3.259s]
[INFO] Apache CloudStack Plugin - Network Nicira NVP ..... SUCCESS [6.075s]
[INFO] Apache CloudStack Plugin - BigSwitch Virtual Network Segment  SUCCESS [5.007s]
[INFO] Apache CloudStack Plugin - Midokura Midonet ....... SUCCESS [6.920s]
[INFO] Apache CloudStack Plugin - Storage Allocator Random  SUCCESS [3.266s]
[INFO] Apache CloudStack Plugin - User Authenticator LDAP  SUCCESS [3.268s]
[INFO] Apache CloudStack Plugin - User Authenticator MD5 . SUCCESS [2.886s]
[INFO] Apache CloudStack Plugin - User Authenticator Plain Text  SUCCESS [2.914s]
[INFO] Apache CloudStack Plugin - User Authenticator SHA256 Salted  SUCCESS [4.706s]
[INFO] Apache CloudStack Plugin - Dns Notifier Example ... SUCCESS [3.257s]
[INFO] Apache CloudStack Plugin - Storage Image S3 ....... SUCCESS [2.193s]
[INFO] Apache CloudStack Plugin - Storage Volume solidfire  SUCCESS [4.145s]
[INFO] Apache CloudStack Plugin - Storage Volume default provider  SUCCESS [3.427s]
[INFO] Apache CloudStack Plugin - SNMP Alerts ............ SUCCESS [6.172s]
[INFO] Apache CloudStack Plugin - Syslog Alerts .......... SUCCESS [4.149s]
[INFO] Apache CloudStack Console Proxy Service ........... SUCCESS [0.539s]
[INFO] Apache CloudStack Console Proxy Plugin ............ SUCCESS [0.543s]
[INFO] Apache CloudStack Console Proxy ................... SUCCESS [9.558s]
[INFO] Apache CloudStack Test ............................ SUCCESS [4.189s]
[INFO] Apache CloudStack Client UI ....................... SUCCESS [11.353s]
[INFO] ------------------------------------------------------------------------
[INFO] BUILD SUCCESS
[INFO] ------------------------------------------------------------------------
[INFO] Total time: 6:03.189s
[INFO] Finished at: Thu May 02 13:04:08 UTC 2013
[INFO] Final Memory: 44M/146M
[INFO] ------------------------------------------------------------------------
[JENKINS] Archiving disabled
[JENKINS] Archiving disabled
[JENKINS] Archiving disabled
[JENKINS] Archiving disabled
[JENKINS] Archiving disabled
[JENKINS] Archiving disabled
[JENKINS] Archiving disabled
[JENKINS] Archiving disabled
[JENKINS] Archiving disabled
[JENKINS] Archiving disabled
[JENKINS] Archiving disabled
[JENKINS] Archiving disabled
[JENKINS] Archiving disabled
[JENKINS] Archiving disabled
[JENKINS] Archiving disabled
[JENKINS] Archiving disabled
[JENKINS] Archiving disabled
[JENKINS] Archiving disabled
[JENKINS] Archiving disabled
[JENKINS] Archiving disabled
[JENKINS] Archiving disabled
[JENKINS] Archiving disabled
[JENKINS] Archiving disabled
[JENKINS] Archiving disabled
[JENKINS] Archiving disabled
[JENKINS] Archiving disabled
[JENKINS] Archiving disabled
[JENKINS] Archiving disabled
[JENKINS] Archiving disabled
[JENKINS] Archiving disabled
[JENKINS] Archiving disabled
[JENKINS] Archiving disabled
[JENKINS] Archiving disabled
[JENKINS] Archiving disabled
[JENKINS] Archiving disabled
[JENKINS] Archiving disabled
[JENKINS] Archiving disabled
[JENKINS] Archiving disabled
[JENKINS] Archiving disabled
[JENKINS] Archiving disabled
[JENKINS] Archiving disabled
[JENKINS] Archiving disabled
[JENKINS] Archiving disabled
[JENKINS] Archiving disabled
[JENKINS] Archiving disabled
[JENKINS] Archiving disabled
[JENKINS] Archiving disabled
[JENKINS] Archiving disabled
[JENKINS] Archiving disabled
[JENKINS] Archiving disabled
[JENKINS] Archiving disabled
[JENKINS] Archiving disabled
[JENKINS] Archiving disabled
[JENKINS] Archiving disabled
[JENKINS] Archiving disabled
[JENKINS] Archiving disabled
[JENKINS] Archiving disabled
[JENKINS] Archiving disabled
[JENKINS] Archiving disabled
[JENKINS] Archiving disabled
[JENKINS] Archiving disabled
[JENKINS] Archiving disabled
[JENKINS] Archiving disabled
[JENKINS] Archiving disabled
[JENKINS] Archiving disabled
[JENKINS] Archiving disabled
[JENKINS] Archiving disabled
Waiting for Jenkins to finish collecting data
channel stopped
[cloudstack-marvin] $ /bin/bash -xe /tmp/hudson5898880241752568707.sh
+ mvn -P developer -pl :cloud-apidoc -pl :cloud-marvin
[INFO] Scanning for projects...
[INFO] ------------------------------------------------------------------------
[INFO] Reactor Build Order:
[INFO] 
[INFO] Apache CloudStack apidocs
[INFO] Apache CloudStack marvin
[INFO]                                                                         
[INFO] ------------------------------------------------------------------------
[INFO] Building Apache CloudStack apidocs 4.2.0-SNAPSHOT
[INFO] ------------------------------------------------------------------------
[INFO] 
[INFO] --- maven-remote-resources-plugin:1.3:process (default) @ cloud-apidoc ---
[INFO] 
[INFO] --- exec-maven-plugin:1.2.1:exec (compile) @ cloud-apidoc ---
Check, is this api part of another build profile? Null value for key: deleteCiscoNexusVSM
preProcessedCommand=1
Check, is this api part of another build profile? Null value for key: enableCiscoNexusVSM
preProcessedCommand=1
Check, is this api part of another build profile? Null value for key: disableCiscoNexusVSM
preProcessedCommand=1
Check, is this api part of another build profile? Null value for key: listCiscoNexusVSMs preProcessedCommand=1
Check, is this api part of another build profile? Null value for key: addExternalLoadBalancer
preProcessedCommand=1
Check, is this api part of another build profile? Null value for key: deleteExternalLoadBalancer
preProcessedCommand=1
Check, is this api part of another build profile? Null value for key: listExternalLoadBalancers
preProcessedCommand=1
Check, is this api part of another build profile? Null value for key: addF5LoadBalancer preProcessedCommand=1
Check, is this api part of another build profile? Null value for key: configureF5LoadBalancer
preProcessedCommand=1
Check, is this api part of another build profile? Null value for key: deleteF5LoadBalancer
preProcessedCommand=1
Check, is this api part of another build profile? Null value for key: listF5LoadBalancers
preProcessedCommand=1
Check, is this api part of another build profile? Null value for key: listF5LoadBalancerNetworks
preProcessedCommand=1
Check, is this api part of another build profile? Null value for key: addExternalFirewall
preProcessedCommand=1
Check, is this api part of another build profile? Null value for key: deleteExternalFirewall
preProcessedCommand=1
Check, is this api part of another build profile? Null value for key: listExternalFirewalls
preProcessedCommand=1
Check, is this api part of another build profile? Null value for key: addSrxFirewall preProcessedCommand=1
Check, is this api part of another build profile? Null value for key: deleteSrxFirewall preProcessedCommand=1
Check, is this api part of another build profile? Null value for key: configureSrxFirewall
preProcessedCommand=1
Check, is this api part of another build profile? Null value for key: listSrxFirewalls preProcessedCommand=1
Check, is this api part of another build profile? Null value for key: listSrxFirewallNetworks
preProcessedCommand=1
Check, is this api part of another build profile? Null value for key: createVolumeOnFiler
preProcessedCommand=15
Check, is this api part of another build profile? Null value for key: destroyVolumeOnFiler
preProcessedCommand=15
Check, is this api part of another build profile? Null value for key: listVolumesOnFiler preProcessedCommand=15
Check, is this api part of another build profile? Null value for key: createLunOnFiler preProcessedCommand=15
Check, is this api part of another build profile? Null value for key: destroyLunOnFiler preProcessedCommand=15
Check, is this api part of another build profile? Null value for key: listLunsOnFiler preProcessedCommand=15
Check, is this api part of another build profile? Null value for key: associateLun preProcessedCommand=15
Check, is this api part of another build profile? Null value for key: dissociateLun preProcessedCommand=15
Check, is this api part of another build profile? Null value for key: createPool preProcessedCommand=15
Check, is this api part of another build profile? Null value for key: deletePool preProcessedCommand=15
Check, is this api part of another build profile? Null value for key: modifyPool preProcessedCommand=15
Check, is this api part of another build profile? Null value for key: listPools preProcessedCommand=15
Check, is this api part of another build profile? Null value for key: addNetscalerLoadBalancer
preProcessedCommand=1
Check, is this api part of another build profile? Null value for key: deleteNetscalerLoadBalancer
preProcessedCommand=1
Check, is this api part of another build profile? Null value for key: configureNetscalerLoadBalancer
preProcessedCommand=1
Check, is this api part of another build profile? Null value for key: listNetscalerLoadBalancers
preProcessedCommand=1
Check, is this api part of another build profile? Null value for key: listNetscalerLoadBalancerNetworks
preProcessedCommand=1
Check, is this api part of another build profile? Null value for key: addBaremetalHost preProcessedCommand=1
Check, is this api part of another build profile? Null value for key: addCiscoVnmcResource
preProcessedCommand=1
Check, is this api part of another build profile? Null value for key: deleteCiscoVnmcResource
preProcessedCommand=1
Check, is this api part of another build profile? Null value for key: listCiscoVnmcResources
preProcessedCommand=1
Check, is this api part of another build profile? Null value for key: addCiscoAsa1000vResource
preProcessedCommand=1
Check, is this api part of another build profile? Null value for key: deleteCiscoAsa1000vResource
preProcessedCommand=1
Check, is this api part of another build profile? Null value for key: listCiscoAsa1000vResources
preProcessedCommand=1
[INFO] 
[INFO] --- maven-site-plugin:3.1:attach-descriptor (attach-descriptor) @ cloud-apidoc ---
[INFO] 
[INFO] --- exec-maven-plugin:1.2.1:exec (package) @ cloud-apidoc ---
[INFO] 
[INFO] --- maven-install-plugin:2.3.1:install (default-install) @ cloud-apidoc ---
[INFO] Installing <https://builds.apache.org/job/cloudstack-marvin/ws/tools/apidoc/pom.xml>
to /home/jenkins/.m2/repository/org/apache/cloudstack/cloud-apidoc/4.2.0-SNAPSHOT/cloud-apidoc-4.2.0-SNAPSHOT.pom
[INFO]                                                                         
[INFO] ------------------------------------------------------------------------
[INFO] Building Apache CloudStack marvin 4.2.0-SNAPSHOT
[INFO] ------------------------------------------------------------------------
[INFO] 
[INFO] --- exec-maven-plugin:1.2.1:exec (generate-sources) @ cloud-marvin ---
[INFO] 
[INFO] --- maven-remote-resources-plugin:1.3:process (default) @ cloud-marvin ---
[INFO] 
[INFO] --- maven-site-plugin:3.1:attach-descriptor (attach-descriptor) @ cloud-marvin ---
[INFO] 
[INFO] --- maven-install-plugin:2.3.1:install (default-install) @ cloud-marvin ---
[INFO] Installing <https://builds.apache.org/job/cloudstack-marvin/ws/tools/marvin/pom.xml>
to /home/jenkins/.m2/repository/org/apache/cloudstack/cloud-marvin/4.2.0-SNAPSHOT/cloud-marvin-4.2.0-SNAPSHOT.pom
[INFO] 
[INFO] --- exec-maven-plugin:1.2.1:exec (install) @ cloud-marvin ---
Traceback (most recent call last):
  File "setup.py", line 22, in <module>
    from distribute_setup import use_setuptools
ImportError: No module named distribute_setup
[INFO] ------------------------------------------------------------------------
[INFO] Reactor Summary:
[INFO] 
[INFO] Apache CloudStack apidocs ......................... SUCCESS [25.055s]
[INFO] Apache CloudStack marvin .......................... FAILURE [3.018s]
[INFO] ------------------------------------------------------------------------
[INFO] BUILD FAILURE
[INFO] ------------------------------------------------------------------------
[INFO] Total time: 29.444s
[INFO] Finished at: Thu May 02 13:05:08 UTC 2013
[INFO] Final Memory: 21M/177M
[INFO] ------------------------------------------------------------------------
[ERROR] Failed to execute goal org.codehaus.mojo:exec-maven-plugin:1.2.1:exec (install) on
project cloud-marvin: Command execution failed. Process exited with an error: 1 (Exit value:
1) -> [Help 1]
[ERROR] 
[ERROR] To see the full stack trace of the errors, re-run Maven with the -e switch.
[ERROR] Re-run Maven using the -X switch to enable full debug logging.
[ERROR] 
[ERROR] For more information about the errors and possible solutions, please read the following
articles:
[ERROR] [Help 1] http://cwiki.apache.org/confluence/display/MAVEN/MojoExecutionException
[ERROR] 
[ERROR] After correcting the problems, you can resume the build with the command
[ERROR]   mvn <goals> -rf :cloud-marvin
Build step 'Execute shell' marked build as failure
Archiving artifacts

Mime
View raw message