cloudstack-commits mailing list archives

Site index · List index
Message view « Date » · « Thread »
Top « Date » · « Thread »
From Apache Jenkins Server <jenk...@builds.apache.org>
Subject Build failed in Jenkins: cloudstack-rat-41 #293
Date Mon, 22 Apr 2013 20:10:51 GMT
See <https://builds.apache.org/job/cloudstack-rat-41/293/changes>

Changes:

[chipchilders] Adding additional profiles and properties to mvn version scripts

[chipchilders] Revert "Updating pom.xml version numbers for release 4.1.1-SNAPSHOT"

[chipchilders] Revert "Updating pom.xml version numbers for release 4.1.0"

[chipchilders] Updating pom.xml version numbers for release 4.1.0

[chipchilders] Updating pom.xml version numbers for release 4.1.1-SNAPSHOT

[chipchilders] Fixing version scripts to deal with tools/apidoc/pom.xml

[chipchilders] Revert "Updating pom.xml version numbers for release 4.1.1-SNAPSHOT"

[chipchilders] Revert "Updating pom.xml version numbers for release 4.1.0"

[chipchilders] Updating pom.xml version numbers for release 4.1.0

[chipchilders] Updating pom.xml version numbers for release 4.1.1-SNAPSHOT

------------------------------------------
Started by an SCM change
Started by an SCM change
Started by an SCM change
Started by an SCM change
Started by an SCM change
Started by an SCM change
Started by an SCM change
Started by an SCM change
Started by an SCM change
Started by an SCM change
Started by an SCM change
Started by an SCM change
Started by an SCM change
Started by an SCM change
Started by an SCM change
Started by an SCM change
Started by an SCM change
Started by an SCM change
Started by an SCM change
Started by an SCM change
Started by an SCM change
Started by an SCM change
Started by an SCM change
Started by an SCM change
Started by an SCM change
Started by an SCM change
Started by an SCM change
Started by an SCM change
Started by an SCM change
Started by an SCM change
Started by an SCM change
Started by an SCM change
Started by an SCM change
Started by an SCM change
Started by an SCM change
Started by an SCM change
Started by an SCM change
Started by an SCM change
Started by an SCM change
Started by an SCM change
Started by an SCM change
Started by an SCM change
Started by an SCM change
Building remotely on ubuntu4 in workspace <https://builds.apache.org/job/cloudstack-rat-41/ws/>
Checkout:cloudstack-rat-41 / <https://builds.apache.org/job/cloudstack-rat-41/ws/> -
hudson.remoting.Channel@34549c46:ubuntu4
Using strategy: Default
Last Built Revision: Revision 0f4dd4c5ec46d8ddddb86c562cdd2c2f60c90da8 (origin/4.1)
Fetching changes from 1 remote Git repository
Fetching upstream changes from https://git-wip-us.apache.org/repos/asf/cloudstack.git
Commencing build of Revision 8fe99e64539947ff4645c5ca6addab0593f02c3d (origin/4.1)
Checking out Revision 8fe99e64539947ff4645c5ca6addab0593f02c3d (origin/4.1)
[cloudstack-rat-41] $ /bin/bash -xe /tmp/hudson5142364364796035630.sh
+ /home/jenkins/tools/maven/latest2/bin/mvn --projects=org.apache.cloudstack:cloudstack org.apache.rat:apache-rat-plugin:0.8:check
[INFO] Scanning for projects...
Downloading: http://repo1.maven.org/maven2/org/apache/cloudstack/cloudstack/4.1.0/cloudstack-4.1.0.pom
[INFO] Unable to find resource 'org.apache.cloudstack:cloudstack:pom:4.1.0' in repository
central (http://repo1.maven.org/maven2)
[INFO] ------------------------------------------------------------------------
[ERROR] FATAL ERROR
[INFO] ------------------------------------------------------------------------
[INFO] Error building POM (may not be this project's POM).


Project ID: null:xapi:jar:5.6.100-1-SNAPSHOT

Reason: Cannot find parent: org.apache.cloudstack:cloudstack for project: null:xapi:jar:5.6.100-1-SNAPSHOT
for project null:xapi:jar:5.6.100-1-SNAPSHOT


[INFO] ------------------------------------------------------------------------
[INFO] Trace
org.apache.maven.reactor.MavenExecutionException: Cannot find parent: org.apache.cloudstack:cloudstack
for project: null:xapi:jar:5.6.100-1-SNAPSHOT for project null:xapi:jar:5.6.100-1-SNAPSHOT
	at org.apache.maven.DefaultMaven.getProjects(DefaultMaven.java:404)
	at org.apache.maven.DefaultMaven.doExecute(DefaultMaven.java:272)
	at org.apache.maven.DefaultMaven.execute(DefaultMaven.java:138)
	at org.apache.maven.cli.MavenCli.main(MavenCli.java:362)
	at org.apache.maven.cli.compat.CompatibleMain.main(CompatibleMain.java:60)
	at sun.reflect.NativeMethodAccessorImpl.invoke0(Native Method)
	at sun.reflect.NativeMethodAccessorImpl.invoke(NativeMethodAccessorImpl.java:39)
	at sun.reflect.DelegatingMethodAccessorImpl.invoke(DelegatingMethodAccessorImpl.java:25)
	at java.lang.reflect.Method.invoke(Method.java:597)
	at org.codehaus.classworlds.Launcher.launchEnhanced(Launcher.java:315)
	at org.codehaus.classworlds.Launcher.launch(Launcher.java:255)
	at org.codehaus.classworlds.Launcher.mainWithExitCode(Launcher.java:430)
	at org.codehaus.classworlds.Launcher.main(Launcher.java:375)
Caused by: org.apache.maven.project.ProjectBuildingException: Cannot find parent: org.apache.cloudstack:cloudstack
for project: null:xapi:jar:5.6.100-1-SNAPSHOT for project null:xapi:jar:5.6.100-1-SNAPSHOT
	at org.apache.maven.project.DefaultMavenProjectBuilder.assembleLineage(DefaultMavenProjectBuilder.java:1396)
	at org.apache.maven.project.DefaultMavenProjectBuilder.buildInternal(DefaultMavenProjectBuilder.java:823)
	at org.apache.maven.project.DefaultMavenProjectBuilder.buildFromSourceFileInternal(DefaultMavenProjectBuilder.java:508)
	at org.apache.maven.project.DefaultMavenProjectBuilder.build(DefaultMavenProjectBuilder.java:200)
	at org.apache.maven.DefaultMaven.getProject(DefaultMaven.java:604)
	at org.apache.maven.DefaultMaven.collectProjects(DefaultMaven.java:487)
	at org.apache.maven.DefaultMaven.collectProjects(DefaultMaven.java:560)
	at org.apache.maven.DefaultMaven.getProjects(DefaultMaven.java:391)
	... 12 more
Caused by: org.apache.maven.project.ProjectBuildingException: POM 'org.apache.cloudstack:cloudstack'
not found in repository: Unable to download the artifact from any repository

  org.apache.cloudstack:cloudstack:pom:4.1.0

from the specified remote repositories:
  central (http://repo1.maven.org/maven2)

 for project org.apache.cloudstack:cloudstack
	at org.apache.maven.project.DefaultMavenProjectBuilder.findModelFromRepository(DefaultMavenProjectBuilder.java:605)
	at org.apache.maven.project.DefaultMavenProjectBuilder.assembleLineage(DefaultMavenProjectBuilder.java:1392)
	... 19 more
Caused by: org.apache.maven.artifact.resolver.ArtifactNotFoundException: Unable to download
the artifact from any repository

  org.apache.cloudstack:cloudstack:pom:4.1.0

from the specified remote repositories:
  central (http://repo1.maven.org/maven2)


	at org.apache.maven.artifact.resolver.DefaultArtifactResolver.resolve(DefaultArtifactResolver.java:228)
	at org.apache.maven.artifact.resolver.DefaultArtifactResolver.resolve(DefaultArtifactResolver.java:90)
	at org.apache.maven.project.DefaultMavenProjectBuilder.findModelFromRepository(DefaultMavenProjectBuilder.java:558)
	... 20 more
Caused by: org.apache.maven.wagon.ResourceDoesNotExistException: Unable to download the artifact
from any repository
	at org.apache.maven.artifact.manager.DefaultWagonManager.getArtifact(DefaultWagonManager.java:404)
	at org.apache.maven.artifact.resolver.DefaultArtifactResolver.resolve(DefaultArtifactResolver.java:216)
	... 22 more
[INFO] ------------------------------------------------------------------------
[INFO] Total time: < 1 second
[INFO] Finished at: Mon Apr 22 20:10:50 UTC 2013
[INFO] Final Memory: 2M/61M
[INFO] ------------------------------------------------------------------------
Build step 'Execute shell' marked build as failure
Archiving artifacts

Mime
View raw message