cloudstack-commits mailing list archives

Site index · List index
Message view « Date » · « Thread »
Top « Date » · « Thread »
From Apache Jenkins Server <jenk...@builds.apache.org>
Subject Build failed in Jenkins: cloudstack-rat-master #1066
Date Sat, 23 Mar 2013 15:04:09 GMT
See <https://builds.apache.org/job/cloudstack-rat-master/1066/changes>

Changes:

[tsp] Apache CloudStack has graduated.

------------------------------------------
Started by an SCM change
Building remotely on ubuntu5 in workspace <https://builds.apache.org/job/cloudstack-rat-master/ws/>
Checkout:cloudstack-rat-master / <https://builds.apache.org/job/cloudstack-rat-master/ws/>
- hudson.remoting.Channel@22191f05:ubuntu5
Using strategy: Default
Last Built Revision: Revision 8ecdbd8537d34a6f44aa5b005cd6ee0bdf02bbcb (origin/master)
Fetching changes from 1 remote Git repository
Fetching upstream changes from https://git-wip-us.apache.org/repos/asf/cloudstack.git
Commencing build of Revision 23d301ffd81fbfeba93ad22a18f979ce60f03e77 (origin/master)
Checking out Revision 23d301ffd81fbfeba93ad22a18f979ce60f03e77 (origin/master)
[cloudstack-rat-master] $ /bin/bash -xe /tmp/hudson6033594643727359030.sh
+ /home/jenkins/tools/maven/latest2/bin/mvn --projects=org.apache.cloudstack:cloudstack org.apache.rat:apache-rat-plugin:0.8:check
[INFO] Scanning for projects...
[INFO] ------------------------------------------------------------------------
[ERROR] FATAL ERROR
[INFO] ------------------------------------------------------------------------
[INFO] Error building POM (may not be this project's POM).


Project ID: unknown
POM Location: <https://builds.apache.org/job/cloudstack-rat-master/ws/pom.xml>

Reason: Parse error reading POM. Reason: expected START_TAG or END_TAG not TEXT (position:
TEXT seen ...p://mail-archives.apache.org/mod_mbox/incubator-cloudstack-users</... @106:91)
 for project unknown at <https://builds.apache.org/job/cloudstack-rat-master/ws/pom.xml>


[INFO] ------------------------------------------------------------------------
[INFO] Trace
org.apache.maven.reactor.MavenExecutionException: Parse error reading POM. Reason: expected
START_TAG or END_TAG not TEXT (position: TEXT seen ...p://mail-archives.apache.org/mod_mbox/incubator-cloudstack-users</...
@106:91)  for project unknown at <https://builds.apache.org/job/cloudstack-rat-master/ws/pom.xml>
	at org.apache.maven.DefaultMaven.getProjects(DefaultMaven.java:404)
	at org.apache.maven.DefaultMaven.doExecute(DefaultMaven.java:272)
	at org.apache.maven.DefaultMaven.execute(DefaultMaven.java:138)
	at org.apache.maven.cli.MavenCli.main(MavenCli.java:362)
	at org.apache.maven.cli.compat.CompatibleMain.main(CompatibleMain.java:60)
	at sun.reflect.NativeMethodAccessorImpl.invoke0(Native Method)
	at sun.reflect.NativeMethodAccessorImpl.invoke(NativeMethodAccessorImpl.java:39)
	at sun.reflect.DelegatingMethodAccessorImpl.invoke(DelegatingMethodAccessorImpl.java:25)
	at java.lang.reflect.Method.invoke(Method.java:597)
	at org.codehaus.classworlds.Launcher.launchEnhanced(Launcher.java:315)
	at org.codehaus.classworlds.Launcher.launch(Launcher.java:255)
	at org.codehaus.classworlds.Launcher.mainWithExitCode(Launcher.java:430)
	at org.codehaus.classworlds.Launcher.main(Launcher.java:375)
Caused by: org.apache.maven.project.InvalidProjectModelException: Parse error reading POM.
Reason: expected START_TAG or END_TAG not TEXT (position: TEXT seen ...p://mail-archives.apache.org/mod_mbox/incubator-cloudstack-users</...
@106:91)  for project unknown at <https://builds.apache.org/job/cloudstack-rat-master/ws/pom.xml>
	at org.apache.maven.project.DefaultMavenProjectBuilder.readModel(DefaultMavenProjectBuilder.java:1610)
	at org.apache.maven.project.DefaultMavenProjectBuilder.readModel(DefaultMavenProjectBuilder.java:1571)
	at org.apache.maven.project.DefaultMavenProjectBuilder.buildFromSourceFileInternal(DefaultMavenProjectBuilder.java:506)
	at org.apache.maven.project.DefaultMavenProjectBuilder.build(DefaultMavenProjectBuilder.java:200)
	at org.apache.maven.DefaultMaven.getProject(DefaultMaven.java:604)
	at org.apache.maven.DefaultMaven.collectProjects(DefaultMaven.java:487)
	at org.apache.maven.DefaultMaven.getProjects(DefaultMaven.java:391)
	... 12 more
Caused by: org.codehaus.plexus.util.xml.pull.XmlPullParserException: expected START_TAG or
END_TAG not TEXT (position: TEXT seen ...p://mail-archives.apache.org/mod_mbox/incubator-cloudstack-users</...
@106:91) 
	at hidden.org.codehaus.plexus.util.xml.pull.MXParser.nextTag(MXParser.java:1095)
	at org.apache.maven.model.io.xpp3.MavenXpp3Reader.parseMailingList(MavenXpp3Reader.java:1788)
	at org.apache.maven.model.io.xpp3.MavenXpp3Reader.parseModel(MavenXpp3Reader.java:1923)
	at org.apache.maven.model.io.xpp3.MavenXpp3Reader.read(MavenXpp3Reader.java:3912)
	at org.apache.maven.project.DefaultMavenProjectBuilder.readModel(DefaultMavenProjectBuilder.java:1606)
	... 18 more
[INFO] ------------------------------------------------------------------------
[INFO] Total time: < 1 second
[INFO] Finished at: Sat Mar 23 15:04:03 UTC 2013
[INFO] Final Memory: 1M/61M
[INFO] ------------------------------------------------------------------------
Build step 'Execute shell' marked build as failure
Archiving artifacts

Mime
View raw message